{"text_format":"1","workbook":"xlsx","n_sheets":13,"sheets":["Coon Rapids","START HERE","Highland","Central","Johnson","Como","Vault","Bars","Beam","Floor","All-Around","Team","EULA"],"not_rendered":{"charts":0,"images":1,"macros":1,"external_links":0,"defined_names":16,"comments":0,"pivot_tables":0},"unopened":[],"bounds":{"document_bytes":16777216,"sheet_cells":100000,"rows_first":2000,"rows_last":500,"rows_between":2000,"halvings":0,"cell_chars":16384,"cell_head_chars":4096},"cells_cut":0,"cells_raw":0,"read":"whole","date_system":"1900"}

{"sheet":"Coon Rapids","index":0,"n_rows":39,"n_cols":6,"rows_kept":39,"cut":false,"hidden":true,"merged":[[0,0,0,4]]}
["Coon Rapids"]
[]
["Vault"]
[null,"Name","Score 1","Score 2","Average","Team"]
[1,null,null,null,{"$f":"(D5+C5)/2","v":0},{"$f":"$A$1","v":"Coon Rapids"}]
[2,null,null,null,{"$f":"(D6+C6)/2","v":0},{"$f":"$A$1","v":"Coon Rapids"}]
[3,null,null,null,{"$f":"(D7+C7)/2","v":0},{"$f":"$A$1","v":"Coon Rapids"}]
[4,null,null,null,{"$f":"(D8+C8)/2","v":0},{"$f":"$A$1","v":"Coon Rapids"}]
[5,null,null,null,{"$f":"(D9+C9)/2","v":0},{"$f":"$A$1","v":"Coon Rapids"}]
[null,null,null,"Team Vault",{"$f":"(SUM(E9+E8+E7+E6+E5)-MIN(E5:E9))","v":0}]
[]
["Bars"]
[null,"Name","Score 1","Score 2","Average"]
[1,null,null,null,{"$f":"(D14+C14)/2","v":0},{"$f":"$A$1","v":"Coon Rapids"}]
[2,null,null,null,{"$f":"(D15+C15)/2","v":0},{"$f":"$A$1","v":"Coon Rapids"}]
[3,null,null,null,{"$f":"(D16+C16)/2","v":0},{"$f":"$A$1","v":"Coon Rapids"}]
[4,null,null,null,{"$f":"(D17+C17)/2","v":0},{"$f":"$A$1","v":"Coon Rapids"}]
[5,null,null,null,{"$f":"(D18+C18)/2","v":0},{"$f":"$A$1","v":"Coon Rapids"}]
[null,null,null,"Team Bars",{"$f":"(SUM(E18+E17+E16+E15+E14)-MIN(E14:E18))","v":0}]
[]
["Beam"]
[null,"Name","Score 1","Score 2","Average"]
[1,null,null,null,{"$f":"(D23+C23)/2","v":0},{"$f":"$A$1","v":"Coon Rapids"}]
[2,null,null,null,{"$f":"(D24+C24)/2","v":0},{"$f":"$A$1","v":"Coon Rapids"}]
[3,null,null,null,{"$f":"(D25+C25)/2","v":0},{"$f":"$A$1","v":"Coon Rapids"}]
[4,null,null,null,{"$f":"(D26+C26)/2","v":0},{"$f":"$A$1","v":"Coon Rapids"}]
[5,null,null,null,{"$f":"(D27+C27)/2","v":0},{"$f":"$A$1","v":"Coon Rapids"}]
[null,null,null,"Team Beam",{"$f":"(SUM(E27+E26+E25+E24+E23)-MIN(E23:E27))","v":0}]
[]
["Floor"]
[null,"Name","Score 1","Score 2","Average"]
[1,null,null,null,{"$f":"(D32+C32)/2","v":0},{"$f":"$A$1","v":"Coon Rapids"}]
[2,null,null,null,{"$f":"(D33+C33)/2","v":0},{"$f":"$A$1","v":"Coon Rapids"}]
[3,null,null,null,{"$f":"(D34+C34)/2","v":0},{"$f":"$A$1","v":"Coon Rapids"}]
[4,null,null,null,{"$f":"(D35+C35)/2","v":0},{"$f":"$A$1","v":"Coon Rapids"}]
[5,null,null,null,{"$f":"(D36+C36)/2","v":0},{"$f":"$A$1","v":"Coon Rapids"}]
[null,null,null,"Team Floor",{"$f":"(SUM(E36+E35+E34+E33+E32)-MIN(E32:E36))","v":0}]
[]
[null,null,null,"Team Total",{"$f":" SUM(E37+E28+E19+E10)","v":0},{"$f":"$A$1","v":"Coon Rapids"}]

{"sheet":"START HERE","index":1,"n_rows":93,"n_cols":2,"rows_kept":93,"cut":false,"hidden":false,"merged":[]}
["GYMNASCORE-V (v2.0)"]
["Varsity Gymnastics Meet Scoring Software"]
["CREATED BY: Janelle Borgen, 612-860-9987"]
[]
["PRIOR TO MEET START"]
[]
["Save the File with the meet name"]
["Save the file with the meet name by selecting the file drop down menu and clicking on \"save as\""]
[]
["Selecting Meet Size"]
["Select the number of teams competing (2-16) by clicking on a number below"]
[]
[]
[]
[]
[]
["The computer will prompt to delete sheets depending on how many teams you select."]
["Select \"delete\" to continue"]
[]
["TO SET UP MEET INFORMATION"]
["Please enter the name of the meet and the date in the boxes below"]
["St. Paul Varsity Competition","Name of Meet"]
["Feb. 6th, 2019","Date of Meet"]
[]
[]
["TO SET UP TEAMS"]
["Please enter team names below in boxes"]
["Highland","Team 1"]
["Central","Team 2"]
["Johnson","Team 3"]
["Como","Team 4"]
[null,"Team 5"]
[null,"Team 6"]
[null,"Team 7"]
[null,"Team 8"]
[null,"Team 9"]
[null,"Team 10"]
[null,"Team 11"]
[null,"Team 12"]
[null,"Team 13"]
[null,"Team 14"]
[null,"Team 15"]
[null,"Team 16"]
[]
["To change the team names on the tabs at the bottom follow instructions below."]
["Right Click on the \"Team 1\" tab located at the bottom of the page and select rename"]
["Type in the name of team 1 and press enter"]
["Repeat for each team"]
[]
["To set up line ups"]
["Click on each cell to enter the gymnasts name"]
["When typing in the names make sure they are exact and pay attention to case"]
["Enter the names of the all-around competitors by typing in the appropriate cells"]
["If \"Check Name\" appears in a cell, double check the spelling for each event"]
[]
[]
["DURING THE MEET"]
[]
["Entering Scores"]
["First you must click on the teams tab at the bottom"]
["Locate the event and the gymnasts name in the line-up."]
["To enter scores, just click on the cell and type in the score"]
["Only enter values for Score 1 and Score 2.  The program will calculate the average automatically."]
[]
["Save Frequently"]
["Make sure to save the file frequently by either pressing \"CTRL\" and \"s\" simultaneously "]
["or using the file drop down menu"]
[]
["Calculating Team Score"]
["In the Varisty version of the software, the team score is calculated automatically."]
[]
["Calculating Places for events, All-around and Team"]
["Select the event tab corresponding to the event desired"]
["Click on the \"calculate places\" box on the right of the scores"]
["Note:  If any changes are made to scores on team sheets, "]
["this function will have to be repeated for accurate placings."]
[]
["Printing Results"]
["Select the page you want to print and "]
["either select print from the drop down \"file\" menu or click the printer icon at the top."]
[]
["Reminders"]
["Remember to save the file often by pressing the \"ctrl\" and \"s\" keys simultaneously"]
["Remember NEVER SAVE OVER THE MASTER .xlt FILE, always save each meet with a new name"]
[]
["Finding Sheets"]
["Use the arrows at the bottom left of the screen to navigate to sheets not shown"]
[]
["Abbreviations"]
["V1 = Vault 1, V2 = Vault 2"]
[]
["Contact Information"]
["With questions contact Janelle Borgen at 612-860-9987"]

{"sheet":"Highland","index":2,"n_rows":59,"n_cols":20,"rows_kept":59,"cut":false,"hidden":false,"merged":[[0,2,0,15],[1,2,1,15],[2,2,2,15],[50,6,50,8]]}
[null,null,{"$f":"'START HERE'!A28","v":"Highland"}]
[null,null,{"$f":"'START HERE'!A22","v":"St. Paul Varsity Competition"}]
[null,null,{"$f":"'START HERE'!A23","v":"Feb. 6th, 2019"}]
[]
[null,null,null,null,null,null,null,null,"VAULT"]
[]
["Team",null,null,null,"Name",null,"Chief Judge",null,"Acting\nJudge",null,"Average",null,"Event \nScore",null,"Neutral \nDed."]
[{"$f":"$C$1","v":"Highland"},null,1,null,"Lili Boyd","V1",8.1,null,8.1,null,{"$f":"(I8+G8)/2-O8","v":8.1},null,{"$f":"IF(K8>K9,K8,K9)","v":8.1999999999999993}]
[null,null,null,null,null,"V2",8.1999999999999993,null,8.1999999999999993,null,8.1999999999999993]
[{"$f":"$C$1","v":"Highland"},null,2,null,"Mya Bishop","V1",8.1999999999999993,null,8.1999999999999993,null,8.1999999999999993,null,{"$f":"IF(K10>K11,K10,K11)","v":8.4}]
[null,null,null,null,null,"V2",8.4,null,8.4,null,8.4]
[{"$f":"$C$1","v":"Highland"},null,3,null,"Lia Wallace","V1",8.35,null,8.35,null,8.35,null,{"$f":"IF(K12>K13,K12,K13)","v":8.6999999999999993}]
[null,null,null,null,null,"V2",8.6999999999999993,null,8.6999999999999993,null,8.6999999999999993]
[{"$f":"$C$1","v":"Highland"},null,4,null,"India David","V1",8.4,null,8.4,null,8.4,null,{"$f":"IF(K14>K15,K14,K15)","v":8.5500000000000007}]
[null,null,null,null,null,"V2",8.5500000000000007,null,8.5500000000000007,null,8.5500000000000007]
[null,null,5,null,"Lucy Lipscomb","V1",9.6,null,9.6,null,9.6,null,{"$f":"IF(K16>K17,K16,K17)","v":9.6}]
[{"$f":"$C$1","v":"Highland"},null,null,null,null,"V2",9.6,null,9.6,null,9.6]
[]
[null,null,null,null,null,null,null,null,null,null,"Total",null,{"$f":"(SUM(M8,M10,M12,M14,M16)-MIN(M8:M17))","v":35.25}]
[]
[null,null,null,null,null,null,null,null,"BARS"]
[null,null,null,null,"Name",null,"Chief Judge",null,"Acting\nJudge",null,"Event \nScore",null,"Neutral \nDed."]
[{"$f":"$C$1","v":"Highland"},null,1,null,"Annika Wetzel",null,7.1,null,7.1,null,{"$f":"(I23+G23)/2-M23","v":7.1}]
[{"$f":"$C$1","v":"Highland"},null,2,null,"India David",null,8.1999999999999993,null,8.1999999999999993,null,{"$f":"(I24+G24)/2-M24","v":8.1999999999999993}]
[{"$f":"$C$1","v":"Highland"},null,3,null,"Lili Boyd",null,7.2,null,7.2,null,{"$f":"(I25+G25)/2-M25","v":7.2}]
[{"$f":"$C$1","v":"Highland"},null,4,null,"Lucy Lipscomb",null,8.4499999999999993,null,8.4499999999999993,null,{"$f":"(I26+G26)/2-M26","v":8.4499999999999993}]
[{"$f":"$C$1","v":"Highland"},null,5,null,"Lia Wallace",null,8.5,null,8.5,null,{"$f":"(I27+G27)/2-M27","v":8.5}]
[]
[null,null,null,null,null,null,null,null,"Total",null,{"$f":"(SUM(K27+K26+K25+K24+K23)-MIN(K23:K27))","v":32.349999999999994}]
[]
[null,null,null,null,null,null,null,null,"BEAM"]
[null,null,null,null,"Name",null,"Chief Judge",null,"Acting\nJudge",null,"Event \nScore",null,"Neutral \nDed."]
[{"$f":"$C$1","v":"Highland"},null,1,null,"Kate Paulson",null,8.1999999999999993,null,8.1999999999999993,null,{"$f":"(I33+G33)/2-M33","v":8.1999999999999993}]
[{"$f":"$C$1","v":"Highland"},null,2,null,"Lili Boyd",null,8.35,null,8.35,null,{"$f":"(I34+G34)/2-M34","v":8.35}]
[{"$f":"$C$1","v":"Highland"},null,3,null,"India David",null,7.65,null,7.65,null,{"$f":"(I35+G35)/2-M35","v":7.65}]
[{"$f":"$C$1","v":"Highland"},null,4,null,"Lia Wallace",null,8,null,8,null,{"$f":"(I36+G36)/2-M36","v":8}]
[{"$f":"$C$1","v":"Highland"},null,5,null,"Lucy Lipscomb",null,9,null,9,null,{"$f":"(I37+G37)/2-M37","v":9}]
[]
[null,null,null,null,null,null,null,null,"Total",null,{"$f":"(SUM(K37+K36+K35+K34+K33)-MIN(K33:K37))","v":33.550000000000004}]
[]
[null,null,null,null,null,null,null,null,"FLOOR"]
[null,null,null,null,"Name",null,"Chief Judge",null,"Acting\nJudge",null,"Event \nScore",null,"Neutral \nDed."]
[{"$f":"$C$1","v":"Highland"},null,1,null,"Annika Wetzel",null,8.3000000000000007,null,8.3000000000000007,null,{"$f":"(I43+G43)/2-M43","v":8.3000000000000007}]
[{"$f":"$C$1","v":"Highland"},null,2,null,"Lili Boyd",null,8.25,null,8.25,null,{"$f":"(I44+G44)/2-M44","v":8.25}]
[{"$f":"$C$1","v":"Highland"},null,3,null,"India David",null,7.9,null,7.9,null,{"$f":"(I45+G45)/2-M45","v":7.9}]
[{"$f":"$C$1","v":"Highland"},null,4,null,"Lia Wallace",null,9.4,null,9.4,null,{"$f":"(I46+G46)/2-M46","v":9.4}]
[{"$f":"$C$1","v":"Highland"},null,5,null,"Lucy Lipscomb",null,9.4499999999999993,null,9.4499999999999993,null,{"$f":"(I47+G47)/2-M47","v":9.4499999999999993}]
[]
[null,null,null,null,null,null,null,null,"Total",null,{"$f":"(SUM(K47+K46+K45+K44+K43)-MIN(K43:K47))","v":35.4}]
[]
[{"$f":"$C$1","v":"Highland"},null,null,null,null,null,"Team Total",null,null,null,{"$f":" SUM(K49+K39+K29+M19)","v":136.55000000000001}]
[]
[null,null,null,null,null,null,null,null,"ALL AROUND"]
[null,null,null,null,"Name",null,"Vault",null,"Bars",null,"Beam",null,"Floor",null,"Total",null,"Tie Breaker\nEvent"]
[{"$f":"$C$1","v":"Highland"},null,1,null,"Lili Boyd",null,{"$f":"IF(E55=$E$8,$M$8,IF($E55=$E$10,$M$10,IF($E55=$E$12,$M$12,IF($E55=$E$14,$M$14,IF($E55=$E$16,$M$16,\"check name spelling\")))))","v":8.1999999999999993},null,{"$f":"IF($E55=$E$23,$K$23,IF($E55=$E$24,$K$24,IF($E55=$E$25,$K$25,IF($E55=$E$26,$K$26,IF($E55=$E$27,$K$27,\"check name spelling\")))))","v":7.2},null,{"$f":"IF($E55=$E$33,$K$33,IF($E55=$E$34,$K$34,IF($E55=$E$35,$K$35,IF($E55=$E$36,$K$36,IF($E55=$E$37,$K$37,\"check name spelling\")))))","v":8.35},null,{"$f":"IF($E55=$E$43,$K$43,IF($E55=$E$44,$K$44,IF($E55=$E$45,$K$45,IF($E55=$E$46,$K$46,IF($E55=$E$47,$K$47,\"check name spelling\")))))","v":8.25},null,{"$f":"IF($G55=\"check name\",0,IF($I55=\"check name\",0,IF($K55=\"check name\",0,IF($M55=\"check name\",0,SUM(G55:M55)))))","v":32}]
[{"$f":"$C$1","v":"Highland"},null,2,null,"India David",null,{"$f":"IF(E56=$E$8,$M$8,IF($E56=$E$10,$M$10,IF($E56=$E$12,$M$12,IF($E56=$E$14,$M$14,IF($E56=$E$16,$M$16,\"check name spelling\")))))","v":8.5500000000000007},null,{"$f":"IF($E56=$E$23,$K$23,IF($E56=$E$24,$K$24,IF($E56=$E$25,$K$25,IF($E56=$E$26,$K$26,IF($E56=$E$27,$K$27,\"check name spelling\")))))","v":8.1999999999999993},null,{"$f":"IF($E56=$E$33,$K$33,IF($E56=$E$34,$K$34,IF($E56=$E$35,$K$35,IF($E56=$E$36,$K$36,IF($E56=$E$37,$K$37,\"check name spelling\")))))","v":7.65},null,{"$f":"IF($E56=$E$43,$K$43,IF($E56=$E$44,$K$44,IF($E56=$E$45,$K$45,IF($E56=$E$46,$K$46,IF($E56=$E$47,$K$47,\"check name spelling\")))))","v":7.9},null,{"$f":"IF($G56=\"check name\",0,IF($I56=\"check name\",0,IF($K56=\"check name\",0,IF($M56=\"check name\",0,SUM(G56:M56)))))","v":32.299999999999997},null,null,null,null,"VT"]
[{"$f":"$C$1","v":"Highland"},null,3,null,"Lia Wallace",null,{"$f":"IF(E57=$E$8,$M$8,IF($E57=$E$10,$M$10,IF($E57=$E$12,$M$12,IF($E57=$E$14,$M$14,IF($E57=$E$16,$M$16,\"check name spelling\")))))","v":8.6999999999999993},null,{"$f":"IF($E57=$E$23,$K$23,IF($E57=$E$24,$K$24,IF($E57=$E$25,$K$25,IF($E57=$E$26,$K$26,IF($E57=$E$27,$K$27,\"check name spelling\")))))","v":8.5},null,{"$f":"IF($E57=$E$33,$K$33,IF($E57=$E$34,$K$34,IF($E57=$E$35,$K$35,IF($E57=$E$36,$K$36,IF($E57=$E$37,$K$37,\"check name spelling\")))))","v":8},null,{"$f":"IF($E57=$E$43,$K$43,IF($E57=$E$44,$K$44,IF($E57=$E$45,$K$45,IF($E57=$E$46,$K$46,IF($E57=$E$47,$K$47,\"check name spelling\")))))","v":9.4},null,{"$f":"IF($G57=\"check name\",0,IF($I57=\"check name\",0,IF($K57=\"check name\",0,IF($M57=\"check name\",0,SUM(G57:M57)))))","v":34.6},null,null,null,null,"BR"]
[{"$f":"$C$1","v":"Highland"},null,4,null,"Lucy Lipscomb",null,{"$f":"IF(E58=$E$8,$M$8,IF($E58=$E$10,$M$10,IF($E58=$E$12,$M$12,IF($E58=$E$14,$M$14,IF($E58=$E$16,$M$16,\"check name spelling\")))))","v":9.6},null,{"$f":"IF($E58=$E$23,$K$23,IF($E58=$E$24,$K$24,IF($E58=$E$25,$K$25,IF($E58=$E$26,$K$26,IF($E58=$E$27,$K$27,\"check name spelling\")))))","v":8.4499999999999993},null,{"$f":"IF($E58=$E$33,$K$33,IF($E58=$E$34,$K$34,IF($E58=$E$35,$K$35,IF($E58=$E$36,$K$36,IF($E58=$E$37,$K$37,\"check name spelling\")))))","v":9},null,{"$f":"IF($E58=$E$43,$K$43,IF($E58=$E$44,$K$44,IF($E58=$E$45,$K$45,IF($E58=$E$46,$K$46,IF($E58=$E$47,$K$47,\"check name spelling\")))))","v":9.4499999999999993},null,{"$f":"IF($G58=\"check name\",0,IF($I58=\"check name\",0,IF($K58=\"check name\",0,IF($M58=\"check name\",0,SUM(G58:M58)))))","v":36.5},null,null,null,null,"BB"]
[{"$f":"$C$1","v":"Highland"},null,5,null,null,null,{"$f":"IF(E59=$E$8,$M$8,IF($E59=$E$10,$M$10,IF($E59=$E$12,$M$12,IF($E59=$E$14,$M$14,IF($E59=$E$16,$M$16,\"check name spelling\")))))","v":"check name spelling"},null,{"$f":"IF($E59=$E$23,$K$23,IF($E59=$E$24,$K$24,IF($E59=$E$25,$K$25,IF($E59=$E$26,$K$26,IF($E59=$E$27,$K$27,\"check name spelling\")))))","v":"check name spelling"},null,{"$f":"IF($E59=$E$33,$K$33,IF($E59=$E$34,$K$34,IF($E59=$E$35,$K$35,IF($E59=$E$36,$K$36,IF($E59=$E$37,$K$37,\"check name spelling\")))))","v":"check name spelling"},null,{"$f":"IF($E59=$E$43,$K$43,IF($E59=$E$44,$K$44,IF($E59=$E$45,$K$45,IF($E59=$E$46,$K$46,IF($E59=$E$47,$K$47,\"check name spelling\")))))","v":"check name spelling"},null,{"$f":"IF($G59=\"check name\",0,IF($I59=\"check name\",0,IF($K59=\"check name\",0,IF($M59=\"check name\",0,SUM(G59:M59)))))","v":0},null,null,null,null,"FL"]

{"sheet":"Central","index":3,"n_rows":59,"n_cols":20,"rows_kept":59,"cut":false,"hidden":false,"merged":[[0,2,0,15],[1,2,1,15],[2,2,2,15],[50,6,50,8]]}
[null,null,{"$f":"'START HERE'!A29","v":"Central"}]
[null,null,{"$f":"'START HERE'!A22","v":"St. Paul Varsity Competition"}]
[null,null,{"$f":"'START HERE'!A23","v":"Feb. 6th, 2019"}]
[]
[null,null,null,null,null,null,null,null,"VAULT"]
[]
["Team",null,null,null,"Name",null,"Chief Judge",null,"Acting\nJudge",null,"Average",null,"Event \nScore",null,"Neutral \nDed."]
[{"$f":"$C$1","v":"Central"},null,1,null,"Maddie Griggs","V1",8,null,8,null,{"$f":"(I8+G8)/2-O8","v":8},null,{"$f":"IF(K8>K9,K8,K9)","v":8.1}]
[null,null,null,null,null,"V2",8.1,null,8.1,null,8.1]
[{"$f":"$C$1","v":"Central"},null,2,null,"Sylvie Chaput","V1",8.4499999999999993,null,8.4499999999999993,null,8.4499999999999993,null,{"$f":"IF(K10>K11,K10,K11)","v":8.4499999999999993}]
[null,null,null,null,null,"V2",8.0500000000000007,null,8.0500000000000007,null,8.0500000000000007]
[{"$f":"$C$1","v":"Central"},null,3,null,"Eden Hunt","V1",8.1999999999999993,null,8.1999999999999993,null,8.1999999999999993,null,{"$f":"IF(K12>K13,K12,K13)","v":8.1999999999999993}]
[null,null,null,null,null,"V2",7.95,null,7.95,null,7.95]
[{"$f":"$C$1","v":"Central"},null,4,null,"Cali Rivera","V1",8.3000000000000007,null,8.3000000000000007,null,8.3000000000000007,null,{"$f":"IF(K14>K15,K14,K15)","v":8.35}]
[null,null,null,null,null,"V2",8.35,null,8.35,null,8.35]
[null,null,5,null,"Saskia Eberman","V1",8.1999999999999993,null,8.1999999999999993,null,8.1999999999999993,null,{"$f":"IF(K16>K17,K16,K17)","v":8.1999999999999993}]
[{"$f":"$C$1","v":"Central"},null,null,null,null,"V2",7.75,null,7.75,null,7.75]
[]
[null,null,null,null,null,null,null,null,null,null,"Total",null,{"$f":"(SUM(M8,M10,M12,M14,M16)-MIN(M8:M17))","v":33.199999999999996}]
[]
[null,null,null,null,null,null,null,null,"BARS"]
[null,null,null,null,"Name",null,"Chief Judge",null,"Acting\nJudge",null,"Event \nScore",null,"Neutral \nDed."]
[{"$f":"$C$1","v":"Central"},null,1,null,"Maddie Griggs",null,4.75,null,4.75,null,{"$f":"(I23+G23)/2-M23","v":4.75}]
[{"$f":"$C$1","v":"Central"},null,2,null,"Lia Guider",null,6.8,null,6.8,null,{"$f":"(I24+G24)/2-M24","v":6.8}]
[{"$f":"$C$1","v":"Central"},null,3,null,"Cali Rivera",null,6.65,null,6.65,null,{"$f":"(I25+G25)/2-M25","v":6.65}]
[{"$f":"$C$1","v":"Central"},null,4,null,"Maddie Arnet",null,6.4,null,6.4,null,{"$f":"(I26+G26)/2-M26","v":6.4}]
[{"$f":"$C$1","v":"Central"},null,5,null,"Eden Hunt",null,7.5,null,7.5,null,{"$f":"(I27+G27)/2-M27","v":7.5}]
[]
[null,null,null,null,null,null,null,null,"Total",null,{"$f":"(SUM(K27+K26+K25+K24+K23)-MIN(K23:K27))","v":27.35}]
[]
[null,null,null,null,null,null,null,null,"BEAM"]
[null,null,null,null,"Name",null,"Chief Judge",null,"Acting\nJudge",null,"Event \nScore",null,"Neutral \nDed."]
[{"$f":"$C$1","v":"Central"},null,1,null,"Sylvie Chaput",null,7.35,null,7.35,null,{"$f":"(I33+G33)/2-M33","v":7.35}]
[{"$f":"$C$1","v":"Central"},null,2,null,"Cali Rivera",null,6.85,null,6.85,null,{"$f":"(I34+G34)/2-M34","v":6.85}]
[{"$f":"$C$1","v":"Central"},null,3,null,"Maddie Griggs",null,7.35,null,7.35,null,{"$f":"(I35+G35)/2-M35","v":7.35}]
[{"$f":"$C$1","v":"Central"},null,4,null,"Gaomong Xiong",null,7.3,null,7.3,null,{"$f":"(I36+G36)/2-M36","v":7.3}]
[{"$f":"$C$1","v":"Central"},null,5,null,"Eden Hunt",null,7.05,null,7.05,null,{"$f":"(I37+G37)/2-M37","v":7.05}]
[]
[null,null,null,null,null,null,null,null,"Total",null,{"$f":"(SUM(K37+K36+K35+K34+K33)-MIN(K33:K37))","v":29.049999999999997}]
[]
[null,null,null,null,null,null,null,null,"FLOOR"]
[null,null,null,null,"Name",null,"Chief Judge",null,"Acting\nJudge",null,"Event \nScore",null,"Neutral \nDed."]
[{"$f":"$C$1","v":"Central"},null,1,null,"Saskia Eberman",null,8.1,null,8.1,null,{"$f":"(I43+G43)/2-M43","v":8.1}]
[{"$f":"$C$1","v":"Central"},null,2,null,"Sylvie Chaput",null,7.7,null,7.7,null,{"$f":"(I44+G44)/2-M44","v":7.7}]
[{"$f":"$C$1","v":"Central"},null,3,null,"Maddie Arnet",null,7.9,null,7.9,null,{"$f":"(I45+G45)/2-M45","v":7.9}]
[{"$f":"$C$1","v":"Central"},null,4,null,"Cali Rivera",null,8.3000000000000007,null,8.3000000000000007,null,{"$f":"(I46+G46)/2-M46","v":8.3000000000000007}]
[{"$f":"$C$1","v":"Central"},null,5,null,"Eden Hunt",null,8.9,null,8.9,null,{"$f":"(I47+G47)/2-M47","v":8.9}]
[]
[null,null,null,null,null,null,null,null,"Total",null,{"$f":"(SUM(K47+K46+K45+K44+K43)-MIN(K43:K47))","v":33.200000000000003}]
[]
[{"$f":"$C$1","v":"Central"},null,null,null,null,null,"Team Total",null,null,null,{"$f":" SUM(K49+K39+K29+M19)","v":122.79999999999998}]
[]
[null,null,null,null,null,null,null,null,"ALL AROUND"]
[null,null,null,null,"Name",null,"Vault",null,"Bars",null,"Beam",null,"Floor",null,"Total",null,"Tie Breaker\nEvent"]
[{"$f":"$C$1","v":"Central"},null,1,null,"Cali Rivera",null,{"$f":"IF(E55=$E$8,$M$8,IF($E55=$E$10,$M$10,IF($E55=$E$12,$M$12,IF($E55=$E$14,$M$14,IF($E55=$E$16,$M$16,\"check name spelling\")))))","v":8.35},null,{"$f":"IF($E55=$E$23,$K$23,IF($E55=$E$24,$K$24,IF($E55=$E$25,$K$25,IF($E55=$E$26,$K$26,IF($E55=$E$27,$K$27,\"check name spelling\")))))","v":6.65},null,{"$f":"IF($E55=$E$33,$K$33,IF($E55=$E$34,$K$34,IF($E55=$E$35,$K$35,IF($E55=$E$36,$K$36,IF($E55=$E$37,$K$37,\"check name spelling\")))))","v":6.85},null,{"$f":"IF($E55=$E$43,$K$43,IF($E55=$E$44,$K$44,IF($E55=$E$45,$K$45,IF($E55=$E$46,$K$46,IF($E55=$E$47,$K$47,\"check name spelling\")))))","v":8.3000000000000007},null,{"$f":"IF($G55=\"check name\",0,IF($I55=\"check name\",0,IF($K55=\"check name\",0,IF($M55=\"check name\",0,SUM(G55:M55)))))","v":30.150000000000002}]
[{"$f":"$C$1","v":"Central"},null,2,null,"Eden Hunt",null,{"$f":"IF(E56=$E$8,$M$8,IF($E56=$E$10,$M$10,IF($E56=$E$12,$M$12,IF($E56=$E$14,$M$14,IF($E56=$E$16,$M$16,\"check name spelling\")))))","v":8.1999999999999993},null,{"$f":"IF($E56=$E$23,$K$23,IF($E56=$E$24,$K$24,IF($E56=$E$25,$K$25,IF($E56=$E$26,$K$26,IF($E56=$E$27,$K$27,\"check name spelling\")))))","v":7.5},null,{"$f":"IF($E56=$E$33,$K$33,IF($E56=$E$34,$K$34,IF($E56=$E$35,$K$35,IF($E56=$E$36,$K$36,IF($E56=$E$37,$K$37,\"check name spelling\")))))","v":7.05},null,{"$f":"IF($E56=$E$43,$K$43,IF($E56=$E$44,$K$44,IF($E56=$E$45,$K$45,IF($E56=$E$46,$K$46,IF($E56=$E$47,$K$47,\"check name spelling\")))))","v":8.9},null,{"$f":"IF($G56=\"check name\",0,IF($I56=\"check name\",0,IF($K56=\"check name\",0,IF($M56=\"check name\",0,SUM(G56:M56)))))","v":31.65},null,null,null,null,"VT"]
[{"$f":"$C$1","v":"Central"},null,3,null,null,null,{"$f":"IF(E57=$E$8,$M$8,IF($E57=$E$10,$M$10,IF($E57=$E$12,$M$12,IF($E57=$E$14,$M$14,IF($E57=$E$16,$M$16,\"check name spelling\")))))","v":"check name spelling"},null,{"$f":"IF($E57=$E$23,$K$23,IF($E57=$E$24,$K$24,IF($E57=$E$25,$K$25,IF($E57=$E$26,$K$26,IF($E57=$E$27,$K$27,\"check name spelling\")))))","v":"check name spelling"},null,{"$f":"IF($E57=$E$33,$K$33,IF($E57=$E$34,$K$34,IF($E57=$E$35,$K$35,IF($E57=$E$36,$K$36,IF($E57=$E$37,$K$37,\"check name spelling\")))))","v":"check name spelling"},null,{"$f":"IF($E57=$E$43,$K$43,IF($E57=$E$44,$K$44,IF($E57=$E$45,$K$45,IF($E57=$E$46,$K$46,IF($E57=$E$47,$K$47,\"check name spelling\")))))","v":"check name spelling"},null,{"$f":"IF($G57=\"check name\",0,IF($I57=\"check name\",0,IF($K57=\"check name\",0,IF($M57=\"check name\",0,SUM(G57:M57)))))","v":0},null,null,null,null,"BR"]
[{"$f":"$C$1","v":"Central"},null,4,null,null,null,{"$f":"IF(E58=$E$8,$M$8,IF($E58=$E$10,$M$10,IF($E58=$E$12,$M$12,IF($E58=$E$14,$M$14,IF($E58=$E$16,$M$16,\"check name spelling\")))))","v":"check name spelling"},null,{"$f":"IF($E58=$E$23,$K$23,IF($E58=$E$24,$K$24,IF($E58=$E$25,$K$25,IF($E58=$E$26,$K$26,IF($E58=$E$27,$K$27,\"check name spelling\")))))","v":"check name spelling"},null,{"$f":"IF($E58=$E$33,$K$33,IF($E58=$E$34,$K$34,IF($E58=$E$35,$K$35,IF($E58=$E$36,$K$36,IF($E58=$E$37,$K$37,\"check name spelling\")))))","v":"check name spelling"},null,{"$f":"IF($E58=$E$43,$K$43,IF($E58=$E$44,$K$44,IF($E58=$E$45,$K$45,IF($E58=$E$46,$K$46,IF($E58=$E$47,$K$47,\"check name spelling\")))))","v":"check name spelling"},null,{"$f":"IF($G58=\"check name\",0,IF($I58=\"check name\",0,IF($K58=\"check name\",0,IF($M58=\"check name\",0,SUM(G58:M58)))))","v":0},null,null,null,null,"BB"]
[{"$f":"$C$1","v":"Central"},null,5,null,null,null,{"$f":"IF(E59=$E$8,$M$8,IF($E59=$E$10,$M$10,IF($E59=$E$12,$M$12,IF($E59=$E$14,$M$14,IF($E59=$E$16,$M$16,\"check name spelling\")))))","v":"check name spelling"},null,{"$f":"IF($E59=$E$23,$K$23,IF($E59=$E$24,$K$24,IF($E59=$E$25,$K$25,IF($E59=$E$26,$K$26,IF($E59=$E$27,$K$27,\"check name spelling\")))))","v":"check name spelling"},null,{"$f":"IF($E59=$E$33,$K$33,IF($E59=$E$34,$K$34,IF($E59=$E$35,$K$35,IF($E59=$E$36,$K$36,IF($E59=$E$37,$K$37,\"check name spelling\")))))","v":"check name spelling"},null,{"$f":"IF($E59=$E$43,$K$43,IF($E59=$E$44,$K$44,IF($E59=$E$45,$K$45,IF($E59=$E$46,$K$46,IF($E59=$E$47,$K$47,\"check name spelling\")))))","v":"check name spelling"},null,{"$f":"IF($G59=\"check name\",0,IF($I59=\"check name\",0,IF($K59=\"check name\",0,IF($M59=\"check name\",0,SUM(G59:M59)))))","v":0},null,null,null,null,"FL"]

{"sheet":"Johnson","index":4,"n_rows":59,"n_cols":20,"rows_kept":59,"cut":false,"hidden":false,"merged":[[0,2,0,15],[1,2,1,15],[2,2,2,15],[50,6,50,8]]}
[null,null,{"$f":"'START HERE'!A30","v":"Johnson"}]
[null,null,{"$f":"'START HERE'!A22","v":"St. Paul Varsity Competition"}]
[null,null,{"$f":"'START HERE'!A23","v":"Feb. 6th, 2019"}]
[]
[null,null,null,null,null,null,null,null,"VAULT"]
[]
["Team",null,null,null,"Name",null,"Chief Judge",null,"Acting\nJudge",null,"Average",null,"Event \nScore",null,"Neutral \nDed."]
[{"$f":"$C$1","v":"Johnson"},null,1,null,"Janpen Thao","V1",6.9,null,6.9,null,{"$f":"(I8+G8)/2-O8","v":6.9},null,{"$f":"IF(K8>K9,K8,K9)","v":6.9}]
[null,null,null,null,null,"V2",6.5,null,6.5,null,6.5]
[{"$f":"$C$1","v":"Johnson"},null,2,null,"Jee Xiong","V1",6.6,null,6.6,null,6.6,null,{"$f":"IF(K10>K11,K10,K11)","v":6.6}]
[null,null,null,null,null,"V2",6.1,null,6.1,null,6.1]
[{"$f":"$C$1","v":"Johnson"},null,3,null,"Mariana Urbina","V1",6.7,null,6.7,null,6.7,null,{"$f":"IF(K12>K13,K12,K13)","v":6.85}]
[null,null,null,null,null,"V2",6.85,null,6.85,null,6.85]
[{"$f":"$C$1","v":"Johnson"},null,4,null,"Txiab Xiong","V1",6.5,null,6.5,null,6.5,null,{"$f":"IF(K14>K15,K14,K15)","v":6.5}]
[null,null,null,null,null,"V2",6.5,null,6.5,null,6.5]
[null,null,5,null,"De'Quaia Crenshaw","V1",6.6,null,6.6,null,6.6,null,{"$f":"IF(K16>K17,K16,K17)","v":6.8}]
[{"$f":"$C$1","v":"Johnson"},null,null,null,null,"V2",6.8,null,6.8,null,6.8]
[]
[null,null,null,null,null,null,null,null,null,null,"Total",null,{"$f":"(SUM(M8,M10,M12,M14,M16)-MIN(M8:M17))","v":27.15}]
[]
[null,null,null,null,null,null,null,null,"BARS"]
[null,null,null,null,"Name",null,"Chief Judge",null,"Acting\nJudge",null,"Event \nScore",null,"Neutral \nDed."]
[{"$f":"$C$1","v":"Johnson"},null,1,null,"Jee Xiong",null,3.7,null,3.7,null,{"$f":"(I23+G23)/2-M23","v":3.7}]
[{"$f":"$C$1","v":"Johnson"},null,2,null,"Txiab Xiong",null,3.85,null,3.85,null,{"$f":"(I24+G24)/2-M24","v":3.85}]
[{"$f":"$C$1","v":"Johnson"},null,3,null,"Mariana Urbina",null,4.0999999999999996,null,4.0999999999999996,null,{"$f":"(I25+G25)/2-M25","v":4.0999999999999996}]
[{"$f":"$C$1","v":"Johnson"},null,4,null,"Nevaeh Sangster-Lamb",null,3.9,null,3.9,null,{"$f":"(I26+G26)/2-M26","v":3.9}]
[{"$f":"$C$1","v":"Johnson"},null,5,null,"De'Quaia Crenshaw",null,6.9,null,6.9,null,{"$f":"(I27+G27)/2-M27","v":6.9}]
[]
[null,null,null,null,null,null,null,null,"Total",null,{"$f":"(SUM(K27+K26+K25+K24+K23)-MIN(K23:K27))","v":18.75}]
[]
[null,null,null,null,null,null,null,null,"BEAM"]
[null,null,null,null,"Name",null,"Chief Judge",null,"Acting\nJudge",null,"Event \nScore",null,"Neutral \nDed."]
[{"$f":"$C$1","v":"Johnson"},null,1,null,"Tahnia Townsend",null,4,null,4,null,{"$f":"(I33+G33)/2-M33","v":4}]
[{"$f":"$C$1","v":"Johnson"},null,2,null,"Mariana Urbina",null,4.4000000000000004,null,4.4000000000000004,null,{"$f":"(I34+G34)/2-M34","v":4.4000000000000004}]
[{"$f":"$C$1","v":"Johnson"},null,3,null,"Txiab Xiong",null,5.0999999999999996,null,5.0999999999999996,null,{"$f":"(I35+G35)/2-M35","v":5.0999999999999996}]
[{"$f":"$C$1","v":"Johnson"},null,4,null,"Navaeh Sangster-Lamb",null,5.75,null,5.75,null,{"$f":"(I36+G36)/2-M36","v":5.75}]
[{"$f":"$C$1","v":"Johnson"},null,5,null,"De'Quaia Crenshaw",null,4.7,null,4.7,null,{"$f":"(I37+G37)/2-M37","v":4.7}]
[]
[null,null,null,null,null,null,null,null,"Total",null,{"$f":"(SUM(K37+K36+K35+K34+K33)-MIN(K33:K37))","v":19.95}]
[]
[null,null,null,null,null,null,null,null,"FLOOR"]
[null,null,null,null,"Name",null,"Chief Judge",null,"Acting\nJudge",null,"Event \nScore",null,"Neutral \nDed."]
[{"$f":"$C$1","v":"Johnson"},null,1,null,"Nevaeh Sangster-Lamb",null,6,null,6,null,{"$f":"(I43+G43)/2-M43","v":6}]
[{"$f":"$C$1","v":"Johnson"},null,2,null,"Txiab Xiong",null,6.4,null,6.4,null,{"$f":"(I44+G44)/2-M44","v":6.4}]
[{"$f":"$C$1","v":"Johnson"},null,3,null,"Mariana Urbina",null,6.3,null,6.3,null,{"$f":"(I45+G45)/2-M45","v":6.3}]
[{"$f":"$C$1","v":"Johnson"},null,4,null,"Tahnia Townsend",null,7.2,null,7.2,null,{"$f":"(I46+G46)/2-M46","v":7.2}]
[{"$f":"$C$1","v":"Johnson"},null,5,null,"De'Quaia Crenshaw",null,7,null,7,null,{"$f":"(I47+G47)/2-M47","v":7}]
[]
[null,null,null,null,null,null,null,null,"Total",null,{"$f":"(SUM(K47+K46+K45+K44+K43)-MIN(K43:K47))","v":26.9}]
[]
[{"$f":"$C$1","v":"Johnson"},null,null,null,null,null,"Team Total",null,null,null,{"$f":" SUM(K49+K39+K29+M19)","v":92.75}]
[]
[null,null,null,null,null,null,null,null,"ALL AROUND"]
[null,null,null,null,"Name",null,"Vault",null,"Bars",null,"Beam",null,"Floor",null,"Total",null,"Tie Breaker\nEvent"]
[{"$f":"$C$1","v":"Johnson"},null,1,null,"Mariana Urbina",null,{"$f":"IF(E55=$E$8,$M$8,IF($E55=$E$10,$M$10,IF($E55=$E$12,$M$12,IF($E55=$E$14,$M$14,IF($E55=$E$16,$M$16,\"check name spelling\")))))","v":6.85},null,{"$f":"IF($E55=$E$23,$K$23,IF($E55=$E$24,$K$24,IF($E55=$E$25,$K$25,IF($E55=$E$26,$K$26,IF($E55=$E$27,$K$27,\"check name spelling\")))))","v":4.0999999999999996},null,{"$f":"IF($E55=$E$33,$K$33,IF($E55=$E$34,$K$34,IF($E55=$E$35,$K$35,IF($E55=$E$36,$K$36,IF($E55=$E$37,$K$37,\"check name spelling\")))))","v":4.4000000000000004},null,{"$f":"IF($E55=$E$43,$K$43,IF($E55=$E$44,$K$44,IF($E55=$E$45,$K$45,IF($E55=$E$46,$K$46,IF($E55=$E$47,$K$47,\"check name spelling\")))))","v":6.3},null,{"$f":"IF($G55=\"check name\",0,IF($I55=\"check name\",0,IF($K55=\"check name\",0,IF($M55=\"check name\",0,SUM(G55:M55)))))","v":21.65}]
[{"$f":"$C$1","v":"Johnson"},null,2,null,"Txiab Xiong",null,{"$f":"IF(E56=$E$8,$M$8,IF($E56=$E$10,$M$10,IF($E56=$E$12,$M$12,IF($E56=$E$14,$M$14,IF($E56=$E$16,$M$16,\"check name spelling\")))))","v":6.5},null,{"$f":"IF($E56=$E$23,$K$23,IF($E56=$E$24,$K$24,IF($E56=$E$25,$K$25,IF($E56=$E$26,$K$26,IF($E56=$E$27,$K$27,\"check name spelling\")))))","v":3.85},null,{"$f":"IF($E56=$E$33,$K$33,IF($E56=$E$34,$K$34,IF($E56=$E$35,$K$35,IF($E56=$E$36,$K$36,IF($E56=$E$37,$K$37,\"check name spelling\")))))","v":5.0999999999999996},null,{"$f":"IF($E56=$E$43,$K$43,IF($E56=$E$44,$K$44,IF($E56=$E$45,$K$45,IF($E56=$E$46,$K$46,IF($E56=$E$47,$K$47,\"check name spelling\")))))","v":6.4},null,{"$f":"IF($G56=\"check name\",0,IF($I56=\"check name\",0,IF($K56=\"check name\",0,IF($M56=\"check name\",0,SUM(G56:M56)))))","v":21.85},null,null,null,null,"VT"]
[{"$f":"$C$1","v":"Johnson"},null,3,null,"De'Quaia Crenshaw",null,{"$f":"IF(E57=$E$8,$M$8,IF($E57=$E$10,$M$10,IF($E57=$E$12,$M$12,IF($E57=$E$14,$M$14,IF($E57=$E$16,$M$16,\"check name spelling\")))))","v":6.8},null,{"$f":"IF($E57=$E$23,$K$23,IF($E57=$E$24,$K$24,IF($E57=$E$25,$K$25,IF($E57=$E$26,$K$26,IF($E57=$E$27,$K$27,\"check name spelling\")))))","v":6.9},null,{"$f":"IF($E57=$E$33,$K$33,IF($E57=$E$34,$K$34,IF($E57=$E$35,$K$35,IF($E57=$E$36,$K$36,IF($E57=$E$37,$K$37,\"check name spelling\")))))","v":4.7},null,{"$f":"IF($E57=$E$43,$K$43,IF($E57=$E$44,$K$44,IF($E57=$E$45,$K$45,IF($E57=$E$46,$K$46,IF($E57=$E$47,$K$47,\"check name spelling\")))))","v":7},null,{"$f":"IF($G57=\"check name\",0,IF($I57=\"check name\",0,IF($K57=\"check name\",0,IF($M57=\"check name\",0,SUM(G57:M57)))))","v":25.4},null,null,null,null,"BR"]
[{"$f":"$C$1","v":"Johnson"},null,4,null,null,null,{"$f":"IF(E58=$E$8,$M$8,IF($E58=$E$10,$M$10,IF($E58=$E$12,$M$12,IF($E58=$E$14,$M$14,IF($E58=$E$16,$M$16,\"check name spelling\")))))","v":"check name spelling"},null,{"$f":"IF($E58=$E$23,$K$23,IF($E58=$E$24,$K$24,IF($E58=$E$25,$K$25,IF($E58=$E$26,$K$26,IF($E58=$E$27,$K$27,\"check name spelling\")))))","v":"check name spelling"},null,{"$f":"IF($E58=$E$33,$K$33,IF($E58=$E$34,$K$34,IF($E58=$E$35,$K$35,IF($E58=$E$36,$K$36,IF($E58=$E$37,$K$37,\"check name spelling\")))))","v":"check name spelling"},null,{"$f":"IF($E58=$E$43,$K$43,IF($E58=$E$44,$K$44,IF($E58=$E$45,$K$45,IF($E58=$E$46,$K$46,IF($E58=$E$47,$K$47,\"check name spelling\")))))","v":"check name spelling"},null,{"$f":"IF($G58=\"check name\",0,IF($I58=\"check name\",0,IF($K58=\"check name\",0,IF($M58=\"check name\",0,SUM(G58:M58)))))","v":0},null,null,null,null,"BB"]
[{"$f":"$C$1","v":"Johnson"},null,5,null,null,null,{"$f":"IF(E59=$E$8,$M$8,IF($E59=$E$10,$M$10,IF($E59=$E$12,$M$12,IF($E59=$E$14,$M$14,IF($E59=$E$16,$M$16,\"check name spelling\")))))","v":"check name spelling"},null,{"$f":"IF($E59=$E$23,$K$23,IF($E59=$E$24,$K$24,IF($E59=$E$25,$K$25,IF($E59=$E$26,$K$26,IF($E59=$E$27,$K$27,\"check name spelling\")))))","v":"check name spelling"},null,{"$f":"IF($E59=$E$33,$K$33,IF($E59=$E$34,$K$34,IF($E59=$E$35,$K$35,IF($E59=$E$36,$K$36,IF($E59=$E$37,$K$37,\"check name spelling\")))))","v":"check name spelling"},null,{"$f":"IF($E59=$E$43,$K$43,IF($E59=$E$44,$K$44,IF($E59=$E$45,$K$45,IF($E59=$E$46,$K$46,IF($E59=$E$47,$K$47,\"check name spelling\")))))","v":"check name spelling"},null,{"$f":"IF($G59=\"check name\",0,IF($I59=\"check name\",0,IF($K59=\"check name\",0,IF($M59=\"check name\",0,SUM(G59:M59)))))","v":0},null,null,null,null,"FL"]

{"sheet":"Como","index":5,"n_rows":59,"n_cols":20,"rows_kept":59,"cut":false,"hidden":false,"merged":[[0,2,0,15],[1,2,1,15],[2,2,2,15],[50,6,50,8]]}
[null,null,{"$f":"'START HERE'!A31","v":"Como"}]
[null,null,{"$f":"'START HERE'!A22","v":"St. Paul Varsity Competition"}]
[null,null,{"$f":"'START HERE'!A23","v":"Feb. 6th, 2019"}]
[]
[null,null,null,null,null,null,null,null,"VAULT"]
[]
["Team",null,null,null,"Name",null,"Chief Judge",null,"Acting\nJudge",null,"Average",null,"Event \nScore",null,"Neutral \nDed."]
[{"$f":"$C$1","v":"Como"},null,1,null,"Emma Osbourne","V1",3.8,null,3.8,null,{"$f":"(I8+G8)/2-O8","v":3.8},null,{"$f":"IF(K8>K9,K8,K9)","v":5.8}]
[null,null,null,null,null,"V2",5.8,null,5.8,null,5.8]
[{"$f":"$C$1","v":"Como"},null,2,null,"Alyssa Aarthon","V1",5.0999999999999996,null,5.0999999999999996,null,5.0999999999999996,null,{"$f":"IF(K10>K11,K10,K11)","v":6.1}]
[null,null,null,null,null,"V2",6.1,null,6.1,null,6.1]
[{"$f":"$C$1","v":"Como"},null,3,null,"Lily Klett","V1",6.35,null,6.35,null,6.35,null,{"$f":"IF(K12>K13,K12,K13)","v":6.35}]
[null,null,null,null,null,"V2",6.2,null,6.2,null,6.2]
[{"$f":"$C$1","v":"Como"},null,4,null,"Amelia Christ ","V1",8.3000000000000007,null,8.3000000000000007,null,8.3000000000000007,null,{"$f":"IF(K14>K15,K14,K15)","v":8.3000000000000007}]
[null,null,null,null,null,"V2",6.9,null,6.9,null,6.9]
[null,null,5,null,null,"V1",null,null,null,null,0,null,{"$f":"IF(K16>K17,K16,K17)","v":0}]
[{"$f":"$C$1","v":"Como"},null,null,null,null,"V2",null,null,null,null,0]
[]
[null,null,null,null,null,null,null,null,null,null,"Total",null,{"$f":"(SUM(M8,M10,M12,M14,M16)-MIN(M8:M17))","v":26.55}]
[]
[null,null,null,null,null,null,null,null,"BARS"]
[null,null,null,null,"Name",null,"Chief Judge",null,"Acting\nJudge",null,"Event \nScore",null,"Neutral \nDed."]
[{"$f":"$C$1","v":"Como"},null,1,null,"Emma Osbourne",null,2.2000000000000002,null,2.2000000000000002,null,{"$f":"(I23+G23)/2-M23","v":2.2000000000000002}]
[{"$f":"$C$1","v":"Como"},null,2,null,"Lily Klett",null,2.7,null,2.7,null,{"$f":"(I24+G24)/2-M24","v":2.7}]
[{"$f":"$C$1","v":"Como"},null,3,null,"Alyssa Aarthon",null,3.3,null,3.3,null,{"$f":"(I25+G25)/2-M25","v":3.3}]
[{"$f":"$C$1","v":"Como"},null,4,null,"Amelia Christ",null,6.5,null,6.5,null,{"$f":"(I26+G26)/2-M26","v":6.5}]
[{"$f":"$C$1","v":"Como"},null,5,null,null,null,null,null,null,null,{"$f":"(I27+G27)/2-M27","v":0}]
[]
[null,null,null,null,null,null,null,null,"Total",null,{"$f":"(SUM(K27+K26+K25+K24+K23)-MIN(K23:K27))","v":14.7}]
[]
[null,null,null,null,null,null,null,null,"BEAM"]
[null,null,null,null,"Name",null,"Chief Judge",null,"Acting\nJudge",null,"Event \nScore",null,"Neutral \nDed."]
[{"$f":"$C$1","v":"Como"},null,1,null,"Alyssa Aarthon",null,3,null,3,null,{"$f":"(I33+G33)/2-M33","v":3}]
[{"$f":"$C$1","v":"Como"},null,2,null,"Minnie Her",null,2.2999999999999998,null,2.2999999999999998,null,{"$f":"(I34+G34)/2-M34","v":2.2999999999999998}]
[{"$f":"$C$1","v":"Como"},null,3,null,"Isabella Hernandez",null,3.6,null,3.6,null,{"$f":"(I35+G35)/2-M35","v":3.6}]
[{"$f":"$C$1","v":"Como"},null,4,null,"Jennifer Rosos",null,4.9000000000000004,null,4.9000000000000004,null,{"$f":"(I36+G36)/2-M36","v":4.9000000000000004}]
[{"$f":"$C$1","v":"Como"},null,5,null,"Amelia Christ",null,7.15,null,7.15,null,{"$f":"(I37+G37)/2-M37","v":7.15}]
[]
[null,null,null,null,null,null,null,null,"Total",null,{"$f":"(SUM(K37+K36+K35+K34+K33)-MIN(K33:K37))","v":18.649999999999999}]
[]
[null,null,null,null,null,null,null,null,"FLOOR"]
[null,null,null,null,"Name",null,"Chief Judge",null,"Acting\nJudge",null,"Event \nScore",null,"Neutral \nDed."]
[{"$f":"$C$1","v":"Como"},null,1,null,"Amelia Hernandez",null,4,null,4,null,{"$f":"(I43+G43)/2-M43","v":4}]
[{"$f":"$C$1","v":"Como"},null,2,null,"Isadora McGinley Myers",null,5.7,null,5.7,null,{"$f":"(I44+G44)/2-M44","v":5.7}]
[{"$f":"$C$1","v":"Como"},null,3,null,"Isabella Hernandez",null,4.7,null,4.7,null,{"$f":"(I45+G45)/2-M45","v":4.7}]
[{"$f":"$C$1","v":"Como"},null,4,null,"Jennifer Rosos",null,5.9,null,5.9,null,{"$f":"(I46+G46)/2-M46","v":5.9}]
[{"$f":"$C$1","v":"Como"},null,5,null,"Amelia Christ",null,7.6,null,7.6,null,{"$f":"(I47+G47)/2-M47","v":7.6}]
[]
[null,null,null,null,null,null,null,null,"Total",null,{"$f":"(SUM(K47+K46+K45+K44+K43)-MIN(K43:K47))","v":23.9}]
[]
[{"$f":"$C$1","v":"Como"},null,null,null,null,null,"Team Total",null,null,null,{"$f":" SUM(K49+K39+K29+M19)","v":83.8}]
[]
[null,null,null,null,null,null,null,null,"ALL AROUND"]
[null,null,null,null,"Name",null,"Vault",null,"Bars",null,"Beam",null,"Floor",null,"Total",null,"Tie Breaker\nEvent"]
[{"$f":"$C$1","v":"Como"},null,1,null,"Amelia Christ",null,{"$f":"IF(E55=$E$8,$M$8,IF($E55=$E$10,$M$10,IF($E55=$E$12,$M$12,IF($E55=$E$14,$M$14,IF($E55=$E$16,$M$16,\"check name spelling\")))))","v":"check name spelling"},null,{"$f":"IF($E55=$E$23,$K$23,IF($E55=$E$24,$K$24,IF($E55=$E$25,$K$25,IF($E55=$E$26,$K$26,IF($E55=$E$27,$K$27,\"check name spelling\")))))","v":6.5},null,{"$f":"IF($E55=$E$33,$K$33,IF($E55=$E$34,$K$34,IF($E55=$E$35,$K$35,IF($E55=$E$36,$K$36,IF($E55=$E$37,$K$37,\"check name spelling\")))))","v":7.15},null,{"$f":"IF($E55=$E$43,$K$43,IF($E55=$E$44,$K$44,IF($E55=$E$45,$K$45,IF($E55=$E$46,$K$46,IF($E55=$E$47,$K$47,\"check name spelling\")))))","v":7.6},null,{"$f":"IF($G55=\"check name\",0,IF($I55=\"check name\",0,IF($K55=\"check name\",0,IF($M55=\"check name\",0,SUM(G55:M55)))))","v":21.25}]
[{"$f":"$C$1","v":"Como"},null,2,null,null,null,{"$f":"IF(E56=$E$8,$M$8,IF($E56=$E$10,$M$10,IF($E56=$E$12,$M$12,IF($E56=$E$14,$M$14,IF($E56=$E$16,$M$16,\"check name spelling\")))))","v":0},null,{"$f":"IF($E56=$E$23,$K$23,IF($E56=$E$24,$K$24,IF($E56=$E$25,$K$25,IF($E56=$E$26,$K$26,IF($E56=$E$27,$K$27,\"check name spelling\")))))","v":0},null,{"$f":"IF($E56=$E$33,$K$33,IF($E56=$E$34,$K$34,IF($E56=$E$35,$K$35,IF($E56=$E$36,$K$36,IF($E56=$E$37,$K$37,\"check name spelling\")))))","v":"check name spelling"},null,{"$f":"IF($E56=$E$43,$K$43,IF($E56=$E$44,$K$44,IF($E56=$E$45,$K$45,IF($E56=$E$46,$K$46,IF($E56=$E$47,$K$47,\"check name spelling\")))))","v":"check name spelling"},null,{"$f":"IF($G56=\"check name\",0,IF($I56=\"check name\",0,IF($K56=\"check name\",0,IF($M56=\"check name\",0,SUM(G56:M56)))))","v":0},null,null,null,null,"VT"]
[{"$f":"$C$1","v":"Como"},null,3,null,null,null,{"$f":"IF(E57=$E$8,$M$8,IF($E57=$E$10,$M$10,IF($E57=$E$12,$M$12,IF($E57=$E$14,$M$14,IF($E57=$E$16,$M$16,\"check name spelling\")))))","v":0},null,{"$f":"IF($E57=$E$23,$K$23,IF($E57=$E$24,$K$24,IF($E57=$E$25,$K$25,IF($E57=$E$26,$K$26,IF($E57=$E$27,$K$27,\"check name spelling\")))))","v":0},null,{"$f":"IF($E57=$E$33,$K$33,IF($E57=$E$34,$K$34,IF($E57=$E$35,$K$35,IF($E57=$E$36,$K$36,IF($E57=$E$37,$K$37,\"check name spelling\")))))","v":"check name spelling"},null,{"$f":"IF($E57=$E$43,$K$43,IF($E57=$E$44,$K$44,IF($E57=$E$45,$K$45,IF($E57=$E$46,$K$46,IF($E57=$E$47,$K$47,\"check name spelling\")))))","v":"check name spelling"},null,{"$f":"IF($G57=\"check name\",0,IF($I57=\"check name\",0,IF($K57=\"check name\",0,IF($M57=\"check name\",0,SUM(G57:M57)))))","v":0},null,null,null,null,"BR"]
[{"$f":"$C$1","v":"Como"},null,4,null,null,null,{"$f":"IF(E58=$E$8,$M$8,IF($E58=$E$10,$M$10,IF($E58=$E$12,$M$12,IF($E58=$E$14,$M$14,IF($E58=$E$16,$M$16,\"check name spelling\")))))","v":0},null,{"$f":"IF($E58=$E$23,$K$23,IF($E58=$E$24,$K$24,IF($E58=$E$25,$K$25,IF($E58=$E$26,$K$26,IF($E58=$E$27,$K$27,\"check name spelling\")))))","v":0},null,{"$f":"IF($E58=$E$33,$K$33,IF($E58=$E$34,$K$34,IF($E58=$E$35,$K$35,IF($E58=$E$36,$K$36,IF($E58=$E$37,$K$37,\"check name spelling\")))))","v":"check name spelling"},null,{"$f":"IF($E58=$E$43,$K$43,IF($E58=$E$44,$K$44,IF($E58=$E$45,$K$45,IF($E58=$E$46,$K$46,IF($E58=$E$47,$K$47,\"check name spelling\")))))","v":"check name spelling"},null,{"$f":"IF($G58=\"check name\",0,IF($I58=\"check name\",0,IF($K58=\"check name\",0,IF($M58=\"check name\",0,SUM(G58:M58)))))","v":0},null,null,null,null,"BB"]
[{"$f":"$C$1","v":"Como"},null,5,null,null,null,{"$f":"IF(E59=$E$8,$M$8,IF($E59=$E$10,$M$10,IF($E59=$E$12,$M$12,IF($E59=$E$14,$M$14,IF($E59=$E$16,$M$16,\"check name spelling\")))))","v":0},null,{"$f":"IF($E59=$E$23,$K$23,IF($E59=$E$24,$K$24,IF($E59=$E$25,$K$25,IF($E59=$E$26,$K$26,IF($E59=$E$27,$K$27,\"check name spelling\")))))","v":0},null,{"$f":"IF($E59=$E$33,$K$33,IF($E59=$E$34,$K$34,IF($E59=$E$35,$K$35,IF($E59=$E$36,$K$36,IF($E59=$E$37,$K$37,\"check name spelling\")))))","v":"check name spelling"},null,{"$f":"IF($E59=$E$43,$K$43,IF($E59=$E$44,$K$44,IF($E59=$E$45,$K$45,IF($E59=$E$46,$K$46,IF($E59=$E$47,$K$47,\"check name spelling\")))))","v":"check name spelling"},null,{"$f":"IF($G59=\"check name\",0,IF($I59=\"check name\",0,IF($K59=\"check name\",0,IF($M59=\"check name\",0,SUM(G59:M59)))))","v":0},null,null,null,null,"FL"]

{"sheet":"Vault","index":6,"n_rows":25,"n_cols":18,"rows_kept":25,"cut":false,"hidden":false,"merged":[[2,1,2,17],[0,1,0,17],[1,1,1,17]]}
[null,"Vault Places"]
[null,{"$f":"'START HERE'!A22","v":"St. Paul Varsity Competition"}]
[null,{"$f":"'START HERE'!A23","v":"Feb. 6th, 2019"}]
[]
[null,"Place","Name",null,"Chief Judge","Acting\nJudge","Neutral Deduction","V1 Score",null,"Chief Judge","Acting\nJudge","Neutral Deduction","V2 Score","Chief Judge for scored vault","Chief Judge for scored vault","Highest chief judge score","Event \nScore","Team"]
[null,1,{"$f":"Highland!$E$8","v":"Lili Boyd"},"V1",{"$f":"Highland!$G$8","v":8.1},{"$f":"Highland!$I$8","v":8.1},{"$f":"Highland!$O$8","v":0},{"$f":"Highland!$K$8","v":8.1},"V2",{"$f":"Highland!$G$9","v":8.1999999999999993},{"$f":"Highland!$I$9","v":8.1999999999999993},{"$f":"Highland!$O$9","v":0},{"$f":"Highland!$K$9","v":8.1999999999999993},{"$f":"IF(Q6=H6,E6,J6)","v":8.1},{"$f":"IF(Q6=M6,J6,D6)","v":"V1"},{"$f":"IF(O6>N6,O6,N6)","v":"V1"},{"$f":"H6","v":8.1},{"$f":"Highland!$C$1","v":"Highland"}]
[null,2,{"$f":"Highland!$E$10","v":"Mya Bishop"},"V1",{"$f":"Highland!$G$10","v":8.1999999999999993},{"$f":"Highland!$I$10","v":8.1999999999999993},{"$f":"Highland!$O$10","v":0},{"$f":"Highland!$K$10","v":8.1999999999999993},"V2",{"$f":"Highland!$G$11","v":8.4},{"$f":"Highland!$I$11","v":8.4},{"$f":"Highland!$O$11","v":0},{"$f":"Highland!$K$11","v":8.4},8.4,8.4,8.4,{"$f":"Highland!$M$10","v":8.4},{"$f":"Highland!$C$1","v":"Highland"}]
[null,3,{"$f":"Highland!$E$12","v":"Lia Wallace"},"V1",{"$f":"Highland!$G$12","v":8.35},{"$f":"Highland!$I$12","v":8.35},{"$f":"Highland!$O$12","v":0},{"$f":"Highland!$K$12","v":8.35},"V2",{"$f":"Highland!$G$13","v":8.6999999999999993},{"$f":"Highland!$I$13","v":8.6999999999999993},{"$f":"Highland!$O$13","v":0},{"$f":"Highland!$K$13","v":8.6999999999999993},8.6999999999999993,8.6999999999999993,8.6999999999999993,{"$f":"Highland!$M$12","v":8.6999999999999993},{"$f":"Highland!$C$1","v":"Highland"}]
[null,4,{"$f":"Highland!$E$14","v":"India David"},"V1",{"$f":"Highland!$G$14","v":8.4},{"$f":"Highland!$I$14","v":8.4},{"$f":"Highland!$O$14","v":0},{"$f":"Highland!$K$14","v":8.4},"V2",{"$f":"Highland!$G$15","v":8.5500000000000007},{"$f":"Highland!$I$15","v":8.5500000000000007},{"$f":"Highland!$O$15","v":0},{"$f":"Highland!$K$15","v":8.5500000000000007},8.5500000000000007,8.5500000000000007,8.5500000000000007,{"$f":"Highland!$M$14","v":8.5500000000000007},{"$f":"Highland!$C$1","v":"Highland"}]
[null,5,{"$f":"Highland!$E$16","v":"Lucy Lipscomb"},"V1",{"$f":"Highland!$G$16","v":9.6},{"$f":"Highland!$I$16","v":9.6},{"$f":"Highland!$O$16","v":0},{"$f":"Highland!$K$16","v":9.6},"V2",{"$f":"Highland!$G$17","v":9.6},{"$f":"Highland!$I$17","v":9.6},{"$f":"Highland!$O$17","v":0},{"$f":"Highland!$K$17","v":9.6},9.6,9.6,9.6,{"$f":"Highland!$M$16","v":9.6},{"$f":"Highland!$C$1","v":"Highland"}]
[null,6,{"$f":"Central!$E$8","v":"Maddie Griggs"},"V1",{"$f":"Central!$G$8","v":8},{"$f":"Central!$I$8","v":8},{"$f":"Central!$O$8","v":0},{"$f":"Central!$K$8","v":8},"V2",{"$f":"Central!$G$9","v":8.1},{"$f":"Central!$I$9","v":8.1},{"$f":"Central!$O$9","v":0},{"$f":"Central!$K$9","v":8.1},8.1,8.1,8.1,{"$f":"Central!$M$8","v":8.1},{"$f":"Central!$C$1","v":"Central"}]
[null,7,{"$f":"Central!$E$10","v":"Sylvie Chaput"},"V1",{"$f":"Central!$G$10","v":8.4499999999999993},{"$f":"Central!$I$10","v":8.4499999999999993},{"$f":"Central!$O$10","v":0},{"$f":"Central!$K$10","v":8.4499999999999993},"V2",{"$f":"Central!$G$11","v":8.0500000000000007},{"$f":"Central!$I$11","v":8.0500000000000007},{"$f":"Central!$O$11","v":0},{"$f":"Central!$K$11","v":8.0500000000000007},8.4499999999999993,"V1","V1",{"$f":"Central!$M$10","v":8.4499999999999993},{"$f":"Central!$C$1","v":"Central"}]
[null,8,{"$f":"Central!$E$12","v":"Eden Hunt"},"V1",{"$f":"Central!$G$12","v":8.1999999999999993},{"$f":"Central!$I$12","v":8.1999999999999993},{"$f":"Central!$O$12","v":0},{"$f":"Central!$K$12","v":8.1999999999999993},"V2",{"$f":"Central!$G$13","v":7.95},{"$f":"Central!$I$13","v":7.95},{"$f":"Central!$O$13","v":0},{"$f":"Central!$K$13","v":7.95},8.1999999999999993,"V1","V1",{"$f":"Central!$M$12","v":8.1999999999999993},{"$f":"Central!$C$1","v":"Central"}]
[null,9,{"$f":"Central!$E$14","v":"Cali Rivera"},"V1",{"$f":"Central!$G$14","v":8.3000000000000007},{"$f":"Central!$I$14","v":8.3000000000000007},{"$f":"Central!$O$14","v":0},{"$f":"Central!$K$14","v":8.3000000000000007},"V2",{"$f":"Central!$G$15","v":8.35},{"$f":"Central!$I$15","v":8.35},{"$f":"Central!$O$15","v":0},{"$f":"Central!$K$15","v":8.35},8.35,8.35,8.35,{"$f":"Central!$M$14","v":8.35},{"$f":"Central!$C$1","v":"Central"}]
[null,10,{"$f":"Central!$E$16","v":"Saskia Eberman"},"V1",{"$f":"Central!$G$16","v":8.1999999999999993},{"$f":"Central!$I$16","v":8.1999999999999993},{"$f":"Central!$O$16","v":0},{"$f":"Central!$K$16","v":8.1999999999999993},"V2",{"$f":"Central!$G$17","v":7.75},{"$f":"Central!$I$17","v":7.75},{"$f":"Central!$O$17","v":0},{"$f":"Central!$K$17","v":7.75},8.1999999999999993,"V1","V1",{"$f":"Central!$M$16","v":8.1999999999999993},{"$f":"Central!$C$1","v":"Central"}]
[null,11,{"$f":"Johnson!$E$8","v":"Janpen Thao"},"V1",{"$f":"Johnson!$G$8","v":6.9},{"$f":"Johnson!$I$8","v":6.9},{"$f":"Johnson!$O$8","v":0},{"$f":"Johnson!$K$8","v":6.9},"V2",{"$f":"Johnson!$G$9","v":6.5},{"$f":"Johnson!$I$9","v":6.5},{"$f":"Johnson!$O$9","v":0},{"$f":"Johnson!$K$9","v":6.5},6.9,"V1","V1",{"$f":"Johnson!$M$8","v":6.9},{"$f":"Johnson!$C$1","v":"Johnson"}]
[null,12,{"$f":"Johnson!$E$10","v":"Jee Xiong"},"V1",{"$f":"Johnson!$G$10","v":6.6},{"$f":"Johnson!$I$10","v":6.6},{"$f":"Johnson!$O$10","v":0},{"$f":"Johnson!$K$10","v":6.6},"V2",{"$f":"Johnson!$G$11","v":6.1},{"$f":"Johnson!$I$11","v":6.1},{"$f":"Johnson!$O$11","v":0},{"$f":"Johnson!$K$11","v":6.1},6.6,"V1","V1",{"$f":"Johnson!$M$10","v":6.6},{"$f":"Johnson!$C$1","v":"Johnson"}]
[null,13,{"$f":"Johnson!$E$12","v":"Mariana Urbina"},"V1",{"$f":"Johnson!$G$12","v":6.7},{"$f":"Johnson!$I$12","v":6.7},{"$f":"Johnson!$O$12","v":0},{"$f":"Johnson!$K$12","v":6.7},"V2",{"$f":"Johnson!$G$13","v":6.85},{"$f":"Johnson!$I$13","v":6.85},{"$f":"Johnson!$O$13","v":0},{"$f":"Johnson!$K$13","v":6.85},6.85,6.85,6.85,{"$f":"Johnson!$M$12","v":6.85},{"$f":"Johnson!$C$1","v":"Johnson"}]
[null,14,{"$f":"Johnson!$E$14","v":"Txiab Xiong"},"V1",{"$f":"Johnson!$G$14","v":6.5},{"$f":"Johnson!$I$14","v":6.5},{"$f":"Johnson!$O$14","v":0},{"$f":"Johnson!$K$14","v":6.5},"V2",{"$f":"Johnson!$G$15","v":6.5},{"$f":"Johnson!$I$15","v":6.5},{"$f":"Johnson!$O$15","v":0},{"$f":"Johnson!$K$15","v":6.5},6.5,6.5,6.5,{"$f":"Johnson!$M$14","v":6.5},{"$f":"Johnson!$C$1","v":"Johnson"}]
[null,15,{"$f":"Johnson!$E$16","v":"De'Quaia Crenshaw"},"V1",{"$f":"Johnson!$G$16","v":6.6},{"$f":"Johnson!$I$16","v":6.6},{"$f":"Johnson!$O$16","v":0},{"$f":"Johnson!$K$16","v":6.6},"V2",{"$f":"Johnson!$G$17","v":6.8},{"$f":"Johnson!$I$17","v":6.8},{"$f":"Johnson!$O$17","v":0},{"$f":"Johnson!$K$17","v":6.8},6.8,6.8,6.8,{"$f":"Johnson!$M$16","v":6.8},{"$f":"Johnson!$C$1","v":"Johnson"}]
[null,16,{"$f":"Como!$E$8","v":"Emma Osbourne"},"V1",{"$f":"Como!$G$8","v":3.8},{"$f":"Como!$I$8","v":3.8},{"$f":"Como!$O$8","v":0},{"$f":"Como!$K$8","v":3.8},"V2",{"$f":"Como!$G$9","v":5.8},{"$f":"Como!$I$9","v":5.8},{"$f":"Como!$O$9","v":0},{"$f":"Como!$K$9","v":5.8},5.8,5.8,5.8,{"$f":"Como!$M$8","v":5.8},{"$f":"Como!$C$1","v":"Como"}]
[null,17,{"$f":"Como!$E$10","v":"Alyssa Aarthon"},"V1",{"$f":"Como!$G$10","v":5.0999999999999996},{"$f":"Como!$I$10","v":5.0999999999999996},{"$f":"Como!$O$10","v":0},{"$f":"Como!$K$10","v":5.0999999999999996},"V2",{"$f":"Como!$G$11","v":6.1},{"$f":"Como!$I$11","v":6.1},{"$f":"Como!$O$11","v":0},{"$f":"Como!$K$11","v":6.1},6.1,6.1,6.1,{"$f":"Como!$M$10","v":6.1},{"$f":"Como!$C$1","v":"Como"}]
[null,18,{"$f":"Como!$E$12","v":"Lily Klett"},"V1",{"$f":"Como!$G$12","v":6.35},{"$f":"Como!$I$12","v":6.35},{"$f":"Como!$O$12","v":0},{"$f":"Como!$K$12","v":6.35},"V2",{"$f":"Como!$G$13","v":6.2},{"$f":"Como!$I$13","v":6.2},{"$f":"Como!$O$13","v":0},{"$f":"Como!$K$13","v":6.2},6.35,"V1","V1",{"$f":"Como!$M$12","v":6.35},{"$f":"Como!$C$1","v":"Como"}]
[null,19,{"$f":"Como!$E$14","v":"Amelia Christ "},"V1",{"$f":"Como!$G$14","v":8.3000000000000007},{"$f":"Como!$I$14","v":8.3000000000000007},{"$f":"Como!$O$14","v":0},{"$f":"Como!$K$14","v":8.3000000000000007},"V2",{"$f":"Como!$G$15","v":6.9},{"$f":"Como!$I$15","v":6.9},{"$f":"Como!$O$15","v":0},{"$f":"Como!$K$15","v":6.9},8.3000000000000007,"V1","V1",{"$f":"Como!$M$14","v":8.3000000000000007},{"$f":"Como!$C$1","v":"Como"}]
[null,20,{"$f":"Como!$E$16","v":0},"V1",{"$f":"Como!$G$16","v":0},{"$f":"Como!$I$16","v":0},{"$f":"Como!$O$16","v":0},{"$f":"Como!$K$16","v":0},"V2",{"$f":"Como!$G$17","v":0},{"$f":"Como!$I$17","v":0},{"$f":"Como!$O$17","v":0},{"$f":"Como!$K$17","v":0},0,0,0,{"$f":"Como!$M$16","v":0},{"$f":"Como!$C$1","v":"Como"}]

{"sheet":"Bars","index":7,"n_rows":25,"n_cols":8,"rows_kept":25,"cut":false,"hidden":false,"merged":[[0,1,0,7],[1,1,1,7],[2,1,2,7]]}
[null,"Bars Places"]
[null,{"$f":"'START HERE'!A22","v":"St. Paul Varsity Competition"}]
[null,{"$f":"'START HERE'!A23","v":"Feb. 6th, 2019"}]
[]
[null,"Place","Name","Chief Judge","Acting\nJudge","Neutral Deduction","Event \nScore","Team"]
[null,1,{"$f":"Highland!$E$23","v":"Annika Wetzel"},{"$f":"Highland!$G$23","v":7.1},{"$f":"Highland!$I$23","v":7.1},{"$f":"Highland!$M$23","v":0},{"$f":"Highland!$K$23","v":7.1},{"$f":"Highland!$C$1","v":"Highland"}]
[null,2,{"$f":"Highland!$E$24","v":"India David"},{"$f":"Highland!$G$24","v":8.1999999999999993},{"$f":"Highland!$I$24","v":8.1999999999999993},{"$f":"Highland!$M$24","v":0},{"$f":"Highland!$K$24","v":8.1999999999999993},{"$f":"Highland!$C$1","v":"Highland"}]
[null,3,{"$f":"Highland!$E$25","v":"Lili Boyd"},{"$f":"Highland!$G$25","v":7.2},{"$f":"Highland!$I$25","v":7.2},{"$f":"Highland!$M$25","v":0},{"$f":"Highland!$K$25","v":7.2},{"$f":"Highland!$C$1","v":"Highland"}]
[null,4,{"$f":"Highland!$E$26","v":"Lucy Lipscomb"},{"$f":"Highland!$G$26","v":8.4499999999999993},{"$f":"Highland!$I$26","v":8.4499999999999993},{"$f":"Highland!$M$26","v":0},{"$f":"Highland!$K$26","v":8.4499999999999993},{"$f":"Highland!$C$1","v":"Highland"}]
[null,5,{"$f":"Highland!$E$27","v":"Lia Wallace"},{"$f":"Highland!$G$27","v":8.5},{"$f":"Highland!$I$27","v":8.5},{"$f":"Highland!$M$27","v":0},{"$f":"Highland!$K$27","v":8.5},{"$f":"Highland!$C$1","v":"Highland"}]
[null,6,{"$f":"Central!$E$23","v":"Maddie Griggs"},{"$f":"Central!$G$23","v":4.75},{"$f":"Central!$I$23","v":4.75},{"$f":"Central!$M$23","v":0},{"$f":"Central!$K$23","v":4.75},{"$f":"Central!$C$1","v":"Central"}]
[null,7,{"$f":"Central!$E$24","v":"Lia Guider"},{"$f":"Central!$G$24","v":6.8},{"$f":"Central!$I$24","v":6.8},{"$f":"Central!$M$24","v":0},{"$f":"Central!$K$24","v":6.8},{"$f":"Central!$C$1","v":"Central"}]
[null,8,{"$f":"Central!$E$25","v":"Cali Rivera"},{"$f":"Central!$G$25","v":6.65},{"$f":"Central!$I$25","v":6.65},{"$f":"Central!$M$25","v":0},{"$f":"Central!$K$25","v":6.65},{"$f":"Central!$C$1","v":"Central"}]
[null,9,{"$f":"Central!$E$26","v":"Maddie Arnet"},{"$f":"Central!$G$26","v":6.4},{"$f":"Central!$I$26","v":6.4},{"$f":"Central!$M$26","v":0},{"$f":"Central!$K$26","v":6.4},{"$f":"Central!$C$1","v":"Central"}]
[null,10,{"$f":"Central!$E$27","v":"Eden Hunt"},{"$f":"Central!$G$27","v":7.5},{"$f":"Central!$I$27","v":7.5},{"$f":"Central!$M$27","v":0},{"$f":"Central!$K$27","v":7.5},{"$f":"Central!$C$1","v":"Central"}]
[null,11,{"$f":"Johnson!$E$23","v":"Jee Xiong"},{"$f":"Johnson!$G$23","v":3.7},{"$f":"Johnson!$I$23","v":3.7},{"$f":"Johnson!$M$23","v":0},{"$f":"Johnson!$K$23","v":3.7},{"$f":"Johnson!$C$1","v":"Johnson"}]
[null,12,{"$f":"Johnson!$E$24","v":"Txiab Xiong"},{"$f":"Johnson!$G$24","v":3.85},{"$f":"Johnson!$I$24","v":3.85},{"$f":"Johnson!$M$24","v":0},{"$f":"Johnson!$K$24","v":3.85},{"$f":"Johnson!$C$1","v":"Johnson"}]
[null,13,{"$f":"Johnson!$E$25","v":"Mariana Urbina"},{"$f":"Johnson!$G$25","v":4.0999999999999996},{"$f":"Johnson!$I$25","v":4.0999999999999996},{"$f":"Johnson!$M$25","v":0},{"$f":"Johnson!$K$25","v":4.0999999999999996},{"$f":"Johnson!$C$1","v":"Johnson"}]
[null,14,{"$f":"Johnson!$E$26","v":"Nevaeh Sangster-Lamb"},{"$f":"Johnson!$G$26","v":3.9},{"$f":"Johnson!$I$26","v":3.9},{"$f":"Johnson!$M$26","v":0},{"$f":"Johnson!$K$26","v":3.9},{"$f":"Johnson!$C$1","v":"Johnson"}]
[null,15,{"$f":"Johnson!$E$27","v":"De'Quaia Crenshaw"},{"$f":"Johnson!$G$27","v":6.9},{"$f":"Johnson!$I$27","v":6.9},{"$f":"Johnson!$M$27","v":0},{"$f":"Johnson!$K$27","v":6.9},{"$f":"Johnson!$C$1","v":"Johnson"}]
[null,16,{"$f":"Como!$E$23","v":"Emma Osbourne"},{"$f":"Como!$G$23","v":2.2000000000000002},{"$f":"Como!$I$23","v":2.2000000000000002},{"$f":"Como!$M$23","v":0},{"$f":"Como!$K$23","v":2.2000000000000002},{"$f":"Como!$C$1","v":"Como"}]
[null,17,{"$f":"Como!$E$24","v":"Lily Klett"},{"$f":"Como!$G$24","v":2.7},{"$f":"Como!$I$24","v":2.7},{"$f":"Como!$M$24","v":0},{"$f":"Como!$K$24","v":2.7},{"$f":"Como!$C$1","v":"Como"}]
[null,18,{"$f":"Como!$E$25","v":"Alyssa Aarthon"},{"$f":"Como!$G$25","v":3.3},{"$f":"Como!$I$25","v":3.3},{"$f":"Como!$M$25","v":0},{"$f":"Como!$K$25","v":3.3},{"$f":"Como!$C$1","v":"Como"}]
[null,19,{"$f":"Como!$E$26","v":"Amelia Christ"},{"$f":"Como!$G$26","v":6.5},{"$f":"Como!$I$26","v":6.5},{"$f":"Como!$M$26","v":0},{"$f":"Como!$K$26","v":6.5},{"$f":"Como!$C$1","v":"Como"}]
[null,20,{"$f":"Como!$E$27","v":0},{"$f":"Como!$G$27","v":0},{"$f":"Como!$I$27","v":0},{"$f":"Como!$M$27","v":0},{"$f":"Como!$K$27","v":0},{"$f":"Como!$C$1","v":"Como"}]

{"sheet":"Beam","index":8,"n_rows":25,"n_cols":8,"rows_kept":25,"cut":false,"hidden":false,"merged":[[2,1,2,7],[1,1,1,7],[0,1,0,7]]}
[null,"Beam Places"]
[null,{"$f":"'START HERE'!A22","v":"St. Paul Varsity Competition"}]
[null,{"$f":"'START HERE'!A23","v":"Feb. 6th, 2019"}]
[]
[null,"Place","Name","Chief Judge","Acting\nJudge","Neutral Deduction","Event \nScore","Team"]
[null,1,{"$f":"Highland!$E$33","v":"Kate Paulson"},{"$f":"Highland!$G$33","v":8.1999999999999993},{"$f":"Highland!$I$33","v":8.1999999999999993},{"$f":"Highland!$M$33","v":0},{"$f":"Highland!$K$33","v":8.1999999999999993},{"$f":"Highland!$C$1","v":"Highland"}]
[null,2,{"$f":"Highland!$E$34","v":"Lili Boyd"},{"$f":"Highland!$G$34","v":8.35},{"$f":"Highland!$I$34","v":8.35},{"$f":"Highland!$M$34","v":0},{"$f":"Highland!$K$34","v":8.35},{"$f":"Highland!$C$1","v":"Highland"}]
[null,3,{"$f":"Highland!$E$35","v":"India David"},{"$f":"Highland!$G$35","v":7.65},{"$f":"Highland!$I$35","v":7.65},{"$f":"Highland!$M$35","v":0},{"$f":"Highland!$K$35","v":7.65},{"$f":"Highland!$C$1","v":"Highland"}]
[null,4,{"$f":"Highland!$E$36","v":"Lia Wallace"},{"$f":"Highland!$G$36","v":8},{"$f":"Highland!$I$36","v":8},{"$f":"Highland!$M$36","v":0},{"$f":"Highland!$K$36","v":8},{"$f":"Highland!$C$1","v":"Highland"}]
[null,5,{"$f":"Highland!$E$37","v":"Lucy Lipscomb"},{"$f":"Highland!$G$37","v":9},{"$f":"Highland!$I$37","v":9},{"$f":"Highland!$M$37","v":0},{"$f":"Highland!$K$37","v":9},{"$f":"Highland!$C$1","v":"Highland"}]
[null,6,{"$f":"Central!$E$33","v":"Sylvie Chaput"},{"$f":"Central!$G$33","v":7.35},{"$f":"Central!$I$33","v":7.35},{"$f":"Central!$M$33","v":0},{"$f":"Central!$K$33","v":7.35},{"$f":"Central!$C$1","v":"Central"}]
[null,7,{"$f":"Central!$E$34","v":"Cali Rivera"},{"$f":"Central!$G$34","v":6.85},{"$f":"Central!$I$34","v":6.85},{"$f":"Central!$M$34","v":0},{"$f":"Central!$K$34","v":6.85},{"$f":"Central!$C$1","v":"Central"}]
[null,8,{"$f":"Central!$E$35","v":"Maddie Griggs"},{"$f":"Central!$G$35","v":7.35},{"$f":"Central!$I$35","v":7.35},{"$f":"Central!$M$35","v":0},{"$f":"Central!$K$35","v":7.35},{"$f":"Central!$C$1","v":"Central"}]
[null,9,{"$f":"Central!$E$36","v":"Gaomong Xiong"},{"$f":"Central!$G$36","v":7.3},{"$f":"Central!$I$36","v":7.3},{"$f":"Central!$M$36","v":0},{"$f":"Central!$K$36","v":7.3},{"$f":"Central!$C$1","v":"Central"}]
[null,10,{"$f":"Central!$E$37","v":"Eden Hunt"},{"$f":"Central!$G$37","v":7.05},{"$f":"Central!$I$37","v":7.05},{"$f":"Central!$M$37","v":0},{"$f":"Central!$K$37","v":7.05},{"$f":"Central!$C$1","v":"Central"}]
[null,11,{"$f":"Johnson!$E$33","v":"Tahnia Townsend"},{"$f":"Johnson!$G$33","v":4},{"$f":"Johnson!$I$33","v":4},{"$f":"Johnson!$M$33","v":0},{"$f":"Johnson!$K$33","v":4},{"$f":"Johnson!$C$1","v":"Johnson"}]
[null,12,{"$f":"Johnson!$E$34","v":"Mariana Urbina"},{"$f":"Johnson!$G$34","v":4.4000000000000004},{"$f":"Johnson!$I$34","v":4.4000000000000004},{"$f":"Johnson!$M$34","v":0},{"$f":"Johnson!$K$34","v":4.4000000000000004},{"$f":"Johnson!$C$1","v":"Johnson"}]
[null,13,{"$f":"Johnson!$E$35","v":"Txiab Xiong"},{"$f":"Johnson!$G$35","v":5.0999999999999996},{"$f":"Johnson!$I$35","v":5.0999999999999996},{"$f":"Johnson!$M$35","v":0},{"$f":"Johnson!$K$35","v":5.0999999999999996},{"$f":"Johnson!$C$1","v":"Johnson"}]
[null,14,{"$f":"Johnson!$E$36","v":"Navaeh Sangster-Lamb"},{"$f":"Johnson!$G$36","v":5.75},{"$f":"Johnson!$I$36","v":5.75},{"$f":"Johnson!$M$36","v":0},{"$f":"Johnson!$K$36","v":5.75},{"$f":"Johnson!$C$1","v":"Johnson"}]
[null,15,{"$f":"Johnson!$E$37","v":"De'Quaia Crenshaw"},{"$f":"Johnson!$G$37","v":4.7},{"$f":"Johnson!$I$37","v":4.7},{"$f":"Johnson!$M$37","v":0},{"$f":"Johnson!$K$37","v":4.7},{"$f":"Johnson!$C$1","v":"Johnson"}]
[null,16,{"$f":"Como!$E$33","v":"Alyssa Aarthon"},{"$f":"Como!$G$33","v":3},{"$f":"Como!$I$33","v":3},{"$f":"Como!$M$33","v":0},{"$f":"Como!$K$33","v":3},{"$f":"Como!$C$1","v":"Como"}]
[null,17,{"$f":"Como!$E$34","v":"Minnie Her"},{"$f":"Como!$G$34","v":2.2999999999999998},{"$f":"Como!$I$34","v":2.2999999999999998},{"$f":"Como!$M$34","v":0},{"$f":"Como!$K$34","v":2.2999999999999998},{"$f":"Como!$C$1","v":"Como"}]
[null,18,{"$f":"Como!$E$35","v":"Isabella Hernandez"},{"$f":"Como!$G$35","v":3.6},{"$f":"Como!$I$35","v":3.6},{"$f":"Como!$M$35","v":0},{"$f":"Como!$K$35","v":3.6},{"$f":"Como!$C$1","v":"Como"}]
[null,19,{"$f":"Como!$E$36","v":"Jennifer Rosos"},{"$f":"Como!$G$36","v":4.9000000000000004},{"$f":"Como!$I$36","v":4.9000000000000004},{"$f":"Como!$M$36","v":0},{"$f":"Como!$K$36","v":4.9000000000000004},{"$f":"Como!$C$1","v":"Como"}]
[null,20,{"$f":"Como!$E$37","v":"Amelia Christ"},{"$f":"Como!$G$37","v":7.15},{"$f":"Como!$I$37","v":7.15},{"$f":"Como!$M$37","v":0},{"$f":"Como!$K$37","v":7.15},{"$f":"Como!$C$1","v":"Como"}]

{"sheet":"Floor","index":9,"n_rows":25,"n_cols":8,"rows_kept":25,"cut":false,"hidden":false,"merged":[[0,1,0,7],[1,1,1,7],[2,1,2,7]]}
[null,"Floor Places"]
[null,{"$f":"'START HERE'!A22","v":"St. Paul Varsity Competition"}]
[null,{"$f":"'START HERE'!A23","v":"Feb. 6th, 2019"}]
[]
[null,"Place","Name","Chief Judge","Acting\nJudge","Neutral Deduction","Event \nScore","Team"]
[null,1,{"$f":"Highland!$E$43","v":"Annika Wetzel"},{"$f":"Highland!$G$43","v":8.3000000000000007},{"$f":"Highland!$I$43","v":8.3000000000000007},{"$f":"Highland!$M$43","v":0},{"$f":"Highland!$K$43","v":8.3000000000000007},{"$f":"Highland!$C$1","v":"Highland"}]
[null,2,{"$f":"Highland!$E$44","v":"Lili Boyd"},{"$f":"Highland!$G$44","v":8.25},{"$f":"Highland!$I$44","v":8.25},{"$f":"Highland!$M$44","v":0},{"$f":"Highland!$K$44","v":8.25},{"$f":"Highland!$C$1","v":"Highland"}]
[null,3,{"$f":"Highland!$E$45","v":"India David"},{"$f":"Highland!$G$45","v":7.9},{"$f":"Highland!$I$45","v":7.9},{"$f":"Highland!$M$45","v":0},{"$f":"Highland!$K$45","v":7.9},{"$f":"Highland!$C$1","v":"Highland"}]
[null,4,{"$f":"Highland!$E$46","v":"Lia Wallace"},{"$f":"Highland!$G$46","v":9.4},{"$f":"Highland!$I$46","v":9.4},{"$f":"Highland!$M$46","v":0},{"$f":"Highland!$K$46","v":9.4},{"$f":"Highland!$C$1","v":"Highland"}]
[null,5,{"$f":"Highland!$E$47","v":"Lucy Lipscomb"},{"$f":"Highland!$G$47","v":9.4499999999999993},{"$f":"Highland!$I$47","v":9.4499999999999993},{"$f":"Highland!$M$47","v":0},{"$f":"Highland!$K$47","v":9.4499999999999993},{"$f":"Highland!$C$1","v":"Highland"}]
[null,6,{"$f":"Central!$E$43","v":"Saskia Eberman"},{"$f":"Central!$G$43","v":8.1},{"$f":"Central!$I$43","v":8.1},{"$f":"Central!$M$43","v":0},{"$f":"Central!$K$43","v":8.1},{"$f":"Central!$C$1","v":"Central"}]
[null,7,{"$f":"Central!$E$44","v":"Sylvie Chaput"},{"$f":"Central!$G$44","v":7.7},{"$f":"Central!$I$44","v":7.7},{"$f":"Central!$M$44","v":0},{"$f":"Central!$K$44","v":7.7},{"$f":"Central!$C$1","v":"Central"}]
[null,8,{"$f":"Central!$E$45","v":"Maddie Arnet"},{"$f":"Central!$G$45","v":7.9},{"$f":"Central!$I$45","v":7.9},{"$f":"Central!$M$45","v":0},{"$f":"Central!$K$45","v":7.9},{"$f":"Central!$C$1","v":"Central"}]
[null,9,{"$f":"Central!$E$46","v":"Cali Rivera"},{"$f":"Central!$G$46","v":8.3000000000000007},{"$f":"Central!$I$46","v":8.3000000000000007},{"$f":"Central!$M$46","v":0},{"$f":"Central!$K$46","v":8.3000000000000007},{"$f":"Central!$C$1","v":"Central"}]
[null,10,{"$f":"Central!$E$47","v":"Eden Hunt"},{"$f":"Central!$G$47","v":8.9},{"$f":"Central!$I$47","v":8.9},{"$f":"Central!$M$47","v":0},{"$f":"Central!$K$47","v":8.9},{"$f":"Central!$C$1","v":"Central"}]
[null,11,{"$f":"Johnson!$E$43","v":"Nevaeh Sangster-Lamb"},{"$f":"Johnson!$G$43","v":6},{"$f":"Johnson!$I$43","v":6},{"$f":"Johnson!$M$43","v":0},{"$f":"Johnson!$K$43","v":6},{"$f":"Johnson!$C$1","v":"Johnson"}]
[null,12,{"$f":"Johnson!$E$44","v":"Txiab Xiong"},{"$f":"Johnson!$G$44","v":6.4},{"$f":"Johnson!$I$44","v":6.4},{"$f":"Johnson!$M$44","v":0},{"$f":"Johnson!$K$44","v":6.4},{"$f":"Johnson!$C$1","v":"Johnson"}]
[null,13,{"$f":"Johnson!$E$45","v":"Mariana Urbina"},{"$f":"Johnson!$G$45","v":6.3},{"$f":"Johnson!$I$45","v":6.3},{"$f":"Johnson!$M$45","v":0},{"$f":"Johnson!$K$45","v":6.3},{"$f":"Johnson!$C$1","v":"Johnson"}]
[null,14,{"$f":"Johnson!$E$46","v":"Tahnia Townsend"},{"$f":"Johnson!$G$46","v":7.2},{"$f":"Johnson!$I$46","v":7.2},{"$f":"Johnson!$M$46","v":0},{"$f":"Johnson!$K$46","v":7.2},{"$f":"Johnson!$C$1","v":"Johnson"}]
[null,15,{"$f":"Johnson!$E$47","v":"De'Quaia Crenshaw"},{"$f":"Johnson!$G$47","v":7},{"$f":"Johnson!$I$47","v":7},{"$f":"Johnson!$M$47","v":0},{"$f":"Johnson!$K$47","v":7},{"$f":"Johnson!$C$1","v":"Johnson"}]
[null,16,{"$f":"Como!$E$43","v":"Amelia Hernandez"},{"$f":"Como!$G$43","v":4},{"$f":"Como!$I$43","v":4},{"$f":"Como!$M$43","v":0},{"$f":"Como!$K$43","v":4},{"$f":"Como!$C$1","v":"Como"}]
[null,17,{"$f":"Como!$E$44","v":"Isadora McGinley Myers"},{"$f":"Como!$G$44","v":5.7},{"$f":"Como!$I$44","v":5.7},{"$f":"Como!$M$44","v":0},{"$f":"Como!$K$44","v":5.7},{"$f":"Como!$C$1","v":"Como"}]
[null,18,{"$f":"Como!$E$45","v":"Isabella Hernandez"},{"$f":"Como!$G$45","v":4.7},{"$f":"Como!$I$45","v":4.7},{"$f":"Como!$M$45","v":0},{"$f":"Como!$K$45","v":4.7},{"$f":"Como!$C$1","v":"Como"}]
[null,19,{"$f":"Como!$E$46","v":"Jennifer Rosos"},{"$f":"Como!$G$46","v":5.9},{"$f":"Como!$I$46","v":5.9},{"$f":"Como!$M$46","v":0},{"$f":"Como!$K$46","v":5.9},{"$f":"Como!$C$1","v":"Como"}]
[null,20,{"$f":"Como!$E$47","v":"Amelia Christ"},{"$f":"Como!$G$47","v":7.6},{"$f":"Como!$I$47","v":7.6},{"$f":"Como!$M$47","v":0},{"$f":"Como!$K$47","v":7.6},{"$f":"Como!$C$1","v":"Como"}]

{"sheet":"All-Around","index":10,"n_rows":25,"n_cols":27,"rows_kept":25,"cut":false,"hidden":false,"merged":[[0,1,0,25],[1,1,1,25],[2,1,2,25],[3,4,3,11],[3,12,3,15],[3,16,3,19],[3,20,3,23]]}
[null,"All-Around Places"]
[null,{"$f":"'START HERE'!A22","v":"St. Paul Varsity Competition"}]
[null,{"$f":"'START HERE'!A23","v":"Feb. 6th, 2019"}]
[null,null,null,null,"Vault",null,null,null,null,null,null,null,"Bars",null,null,null,"Beam",null,null,null,"Floor"]
[null,"Pl","Name",null,"Chief Judge","Acting Judge","Neutral Ded.",null,"Chief Judge","Acting Judge","Neutral Ded.","Vault \nScore","Chief Judge","Acting Judge","Neutral Ded.","Bars \nScore","Chief Judge","Acting Judge","Neutral Ded.","Beam \nScore","Chief Judge","Acting Judge","Neutral Ded.","Floor \nScore","All-Around \nScore","Team","Tie Breaker Event"]
[null,1,{"$f":"Highland!$E$58","v":"Lucy Lipscomb"},"V1",{"$f":"Highland!$G$14","v":8.4},{"$f":"Highland!$I$14","v":8.4},{"$f":"Highland!$O$14","v":0},"V2",{"$f":"Highland!$G$15","v":8.5500000000000007},{"$f":"Highland!$I$15","v":8.5500000000000007},{"$f":"Highland!$M$26","v":0},{"$f":"Highland!$M$14","v":8.5500000000000007},{"$f":"Highland!$G$26","v":8.4499999999999993},{"$f":"Highland!$I$26","v":8.4499999999999993},{"$f":"Highland!$M$26","v":0},{"$f":"Highland!$I$58","v":8.4499999999999993},{"$f":"Highland!$G$36","v":8},{"$f":"Highland!$I$36","v":8},{"$f":"Highland!$M$36","v":0},{"$f":"Highland!$K$58","v":9},{"$f":"Highland!$G$46","v":9.4},{"$f":"Highland!$I$46","v":9.4},{"$f":"Highland!$M$46","v":0},{"$f":"Highland!$M$58","v":9.4499999999999993},{"$f":"Highland!$O$58","v":36.5},{"$f":"Highland!$C$1","v":"Highland"},{"$f":"Highland!$Q$58","v":0}]
[null,2,{"$f":"Highland!$E$57","v":"Lia Wallace"},"V1",{"$f":"Highland!$G$12","v":8.35},{"$f":"Highland!$I$12","v":8.35},{"$f":"Highland!$O$12","v":0},"V2",{"$f":"Highland!$G$13","v":8.6999999999999993},{"$f":"Highland!$I$13","v":8.6999999999999993},{"$f":"Highland!$M$25","v":0},{"$f":"Highland!$M$12","v":8.6999999999999993},{"$f":"Highland!$G$25","v":7.2},{"$f":"Highland!$I$25","v":7.2},{"$f":"Highland!$M$25","v":0},{"$f":"Highland!$I$57","v":8.5},{"$f":"Highland!$G$35","v":7.65},{"$f":"Highland!$I$35","v":7.65},{"$f":"Highland!$M$35","v":0},{"$f":"Highland!$K$57","v":8},{"$f":"Highland!$G$45","v":7.9},{"$f":"Highland!$I$45","v":7.9},{"$f":"Highland!$M$45","v":0},{"$f":"Highland!$M$57","v":9.4},{"$f":"Highland!$O$57","v":34.6},{"$f":"Highland!$C$1","v":"Highland"},{"$f":"Highland!$Q$57","v":0}]
[null,3,{"$f":"Highland!$E$56","v":"India David"},"V1",{"$f":"Highland!$G$10","v":8.1999999999999993},{"$f":"Highland!$I$10","v":8.1999999999999993},{"$f":"Highland!$O$10","v":0},"V2",{"$f":"Highland!$G$11","v":8.4},{"$f":"Highland!$I$11","v":8.4},{"$f":"Highland!$M$24","v":0},{"$f":"Highland!$M$10","v":8.4},{"$f":"Highland!$G$24","v":8.1999999999999993},{"$f":"Highland!$I$24","v":8.1999999999999993},{"$f":"Highland!$M$24","v":0},{"$f":"Highland!$I$56","v":8.1999999999999993},{"$f":"Highland!$G$34","v":8.35},{"$f":"Highland!$I$34","v":8.35},{"$f":"Highland!$M$34","v":0},{"$f":"Highland!$K$56","v":7.65},{"$f":"Highland!$G$44","v":8.25},{"$f":"Highland!$I$44","v":8.25},{"$f":"Highland!$M$44","v":0},{"$f":"Highland!$M$56","v":7.9},{"$f":"Highland!$O$56","v":32.299999999999997},{"$f":"Highland!$C$1","v":"Highland"},{"$f":"Highland!$Q$56","v":0}]
[null,4,{"$f":"Highland!$E$55","v":"Lili Boyd"},"V1",{"$f":"Highland!$G$8","v":8.1},{"$f":"Highland!$I$8","v":8.1},{"$f":"Highland!$O$8","v":0},"V2",{"$f":"Highland!$G$9","v":8.1999999999999993},{"$f":"Highland!$I$9","v":8.1999999999999993},{"$f":"Highland!$M$23","v":0},{"$f":"Highland!$M$8","v":8.1999999999999993},{"$f":"Highland!$G$23","v":7.1},{"$f":"Highland!$I$23","v":7.1},{"$f":"Highland!$M$23","v":0},{"$f":"Highland!$I$55","v":7.2},{"$f":"Highland!$G$33","v":8.1999999999999993},{"$f":"Highland!$I$33","v":8.1999999999999993},{"$f":"Highland!$M$33","v":0},{"$f":"Highland!$K$55","v":8.35},{"$f":"Highland!$G$43","v":8.3000000000000007},{"$f":"Highland!$I$43","v":8.3000000000000007},{"$f":"Highland!$M$43","v":0},{"$f":"Highland!$M$55","v":8.25},{"$f":"Highland!$O$55","v":32},{"$f":"Highland!$C$1","v":"Highland"},{"$f":"Highland!$Q$55","v":0}]
[null,5,{"$f":"Central!$E$56","v":"Eden Hunt"},"V1",{"$f":"Central!$G$10","v":8.4499999999999993},{"$f":"Central!$I$10","v":8.4499999999999993},{"$f":"Central!$O$10","v":0},"V2",{"$f":"Central!$G$11","v":8.0500000000000007},{"$f":"Central!$I$11","v":8.0500000000000007},{"$f":"Central!$M$24","v":0},{"$f":"Central!$M$10","v":8.4499999999999993},{"$f":"Central!$G$24","v":6.8},{"$f":"Central!$I$24","v":6.8},{"$f":"Central!$M$24","v":0},{"$f":"Central!$I$56","v":7.5},{"$f":"Central!$G$34","v":6.85},{"$f":"Central!$I$34","v":6.85},{"$f":"Central!$M$34","v":0},{"$f":"Central!$K$56","v":7.05},{"$f":"Central!$G$44","v":7.7},{"$f":"Central!$I$44","v":7.7},{"$f":"Central!$M$44","v":0},{"$f":"Central!$M$56","v":8.9},{"$f":"Central!$O$56","v":31.65},{"$f":"Central!$C$1","v":"Central"},{"$f":"Central!$Q$56","v":0}]
[null,6,{"$f":"Central!$E$55","v":"Cali Rivera"},"V1",{"$f":"Central!$G$8","v":8},{"$f":"Central!$I$8","v":8},{"$f":"Central!$O$8","v":0},"V2",{"$f":"Central!$G$9","v":8.1},{"$f":"Central!$I$9","v":8.1},{"$f":"Central!$M$23","v":0},{"$f":"Central!$M$8","v":8.1},{"$f":"Central!$G$23","v":4.75},{"$f":"Central!$I$23","v":4.75},{"$f":"Central!$M$23","v":0},{"$f":"Central!$I$55","v":6.65},{"$f":"Central!$G$33","v":7.35},{"$f":"Central!$I$33","v":7.35},{"$f":"Central!$M$33","v":0},{"$f":"Central!$K$55","v":6.85},{"$f":"Central!$G$43","v":8.1},{"$f":"Central!$I$43","v":8.1},{"$f":"Central!$M$43","v":0},{"$f":"Central!$M$55","v":8.3000000000000007},{"$f":"Central!$O$55","v":30.150000000000002},{"$f":"Central!$C$1","v":"Central"},{"$f":"Central!$Q$55","v":0}]
[null,7,{"$f":"Johnson!$E$57","v":"De'Quaia Crenshaw"},"V1",{"$f":"Johnson!$G$12","v":6.7},{"$f":"Johnson!$I$12","v":6.7},{"$f":"Johnson!$O$12","v":0},"V2",{"$f":"Johnson!$G$13","v":6.85},{"$f":"Johnson!$I$13","v":6.85},{"$f":"Johnson!$M$25","v":0},{"$f":"Johnson!$M$12","v":6.85},{"$f":"Johnson!$G$25","v":4.0999999999999996},{"$f":"Johnson!$I$25","v":4.0999999999999996},{"$f":"Johnson!$M$25","v":0},{"$f":"Johnson!$I$57","v":6.9},{"$f":"Johnson!$G$35","v":5.0999999999999996},{"$f":"Johnson!$I$35","v":5.0999999999999996},{"$f":"Johnson!$M$35","v":0},{"$f":"Johnson!$K$57","v":4.7},{"$f":"Johnson!$G$45","v":6.3},{"$f":"Johnson!$I$45","v":6.3},{"$f":"Johnson!$M$45","v":0},{"$f":"Johnson!$M$57","v":7},{"$f":"Johnson!$O$57","v":25.4},{"$f":"Johnson!$C$1","v":"Johnson"},{"$f":"Johnson!$Q$57","v":0}]
[null,8,{"$f":"Johnson!$E$56","v":"Txiab Xiong"},"V1",{"$f":"Johnson!$G$10","v":6.6},{"$f":"Johnson!$I$10","v":6.6},{"$f":"Johnson!$O$10","v":0},"V2",{"$f":"Johnson!$G$11","v":6.1},{"$f":"Johnson!$I$11","v":6.1},{"$f":"Johnson!$M$24","v":0},{"$f":"Johnson!$M$10","v":6.6},{"$f":"Johnson!$G$24","v":3.85},{"$f":"Johnson!$I$24","v":3.85},{"$f":"Johnson!$M$24","v":0},{"$f":"Johnson!$I$56","v":3.85},{"$f":"Johnson!$G$34","v":4.4000000000000004},{"$f":"Johnson!$I$34","v":4.4000000000000004},{"$f":"Johnson!$M$34","v":0},{"$f":"Johnson!$K$56","v":5.0999999999999996},{"$f":"Johnson!$G$44","v":6.4},{"$f":"Johnson!$I$44","v":6.4},{"$f":"Johnson!$M$44","v":0},{"$f":"Johnson!$M$56","v":6.4},{"$f":"Johnson!$O$56","v":21.85},{"$f":"Johnson!$C$1","v":"Johnson"},{"$f":"Johnson!$Q$56","v":0}]
[null,9,{"$f":"Johnson!$E$55","v":"Mariana Urbina"},"V1",{"$f":"Johnson!$G$8","v":6.9},{"$f":"Johnson!$I$8","v":6.9},{"$f":"Johnson!$O$8","v":0},"V2",{"$f":"Johnson!$G$9","v":6.5},{"$f":"Johnson!$I$9","v":6.5},{"$f":"Johnson!$M$23","v":0},{"$f":"Johnson!$M$8","v":6.9},{"$f":"Johnson!$G$23","v":3.7},{"$f":"Johnson!$I$23","v":3.7},{"$f":"Johnson!$M$23","v":0},{"$f":"Johnson!$I$55","v":4.0999999999999996},{"$f":"Johnson!$G$33","v":4},{"$f":"Johnson!$I$33","v":4},{"$f":"Johnson!$M$33","v":0},{"$f":"Johnson!$K$55","v":4.4000000000000004},{"$f":"Johnson!$G$43","v":6},{"$f":"Johnson!$I$43","v":6},{"$f":"Johnson!$M$43","v":0},{"$f":"Johnson!$M$55","v":6.3},{"$f":"Johnson!$O$55","v":21.65},{"$f":"Johnson!$C$1","v":"Johnson"},{"$f":"Johnson!$Q$55","v":0}]
[null,10,{"$f":"Como!$E$55","v":"Amelia Christ"},"V1",{"$f":"Como!$G$8","v":3.8},{"$f":"Como!$I$8","v":3.8},{"$f":"Como!$O$8","v":0},"V2",{"$f":"Como!$G$9","v":5.8},{"$f":"Como!$I$9","v":5.8},{"$f":"Como!$M$23","v":0},{"$f":"Como!$M$8","v":5.8},{"$f":"Como!$G$23","v":2.2000000000000002},{"$f":"Como!$I$23","v":2.2000000000000002},{"$f":"Como!$M$23","v":0},{"$f":"Como!$I$55","v":6.5},{"$f":"Como!$G$33","v":3},{"$f":"Como!$I$33","v":3},{"$f":"Como!$M$33","v":0},{"$f":"Como!$K$55","v":7.15},{"$f":"Como!$G$43","v":4},{"$f":"Como!$I$43","v":4},{"$f":"Como!$M$43","v":0},{"$f":"Como!$M$55","v":7.6},{"$f":"Como!$O$55","v":21.25},{"$f":"Como!$C$1","v":"Como"},{"$f":"Como!$Q$55","v":0}]
[null,11,{"$f":"Highland!$E$59","v":0},"V1",{"$f":"Highland!$G$16","v":9.6},{"$f":"Highland!$I$16","v":9.6},{"$f":"Highland!$O$16","v":0},"V2",{"$f":"Highland!$G$17","v":9.6},{"$f":"Highland!$I$17","v":9.6},{"$f":"Highland!$M$27","v":0},{"$f":"Highland!$M$16","v":9.6},{"$f":"Highland!$G$27","v":8.5},{"$f":"Highland!$I$27","v":8.5},{"$f":"Highland!$M$27","v":0},{"$f":"Highland!$I$59","v":"check name spelling"},{"$f":"Highland!$G$37","v":9},{"$f":"Highland!$I$37","v":9},{"$f":"Highland!$M$37","v":0},{"$f":"Highland!$K$59","v":"check name spelling"},{"$f":"Highland!$G$47","v":9.4499999999999993},{"$f":"Highland!$I$47","v":9.4499999999999993},{"$f":"Highland!$M$47","v":0},{"$f":"Highland!$M$59","v":"check name spelling"},{"$f":"Highland!$O$59","v":0},{"$f":"Highland!$C$1","v":"Highland"},{"$f":"Highland!$Q$59","v":0}]
[null,12,{"$f":"Central!$E$57","v":0},"V1",{"$f":"Central!$G$12","v":8.1999999999999993},{"$f":"Central!$I$12","v":8.1999999999999993},{"$f":"Central!$O$12","v":0},"V2",{"$f":"Central!$G$13","v":7.95},{"$f":"Central!$I$13","v":7.95},{"$f":"Central!$M$25","v":0},{"$f":"Central!$M$12","v":8.1999999999999993},{"$f":"Central!$G$25","v":6.65},{"$f":"Central!$I$25","v":6.65},{"$f":"Central!$M$25","v":0},{"$f":"Central!$I$57","v":"check name spelling"},{"$f":"Central!$G$35","v":7.35},{"$f":"Central!$I$35","v":7.35},{"$f":"Central!$M$35","v":0},{"$f":"Central!$K$57","v":"check name spelling"},{"$f":"Central!$G$45","v":7.9},{"$f":"Central!$I$45","v":7.9},{"$f":"Central!$M$45","v":0},{"$f":"Central!$M$57","v":"check name spelling"},{"$f":"Central!$O$57","v":0},{"$f":"Central!$C$1","v":"Central"},{"$f":"Central!$Q$57","v":0}]
[null,13,{"$f":"Central!$E$58","v":0},"V1",{"$f":"Central!$G$14","v":8.3000000000000007},{"$f":"Central!$I$14","v":8.3000000000000007},{"$f":"Central!$O$14","v":0},"V2",{"$f":"Central!$G$15","v":8.35},{"$f":"Central!$I$15","v":8.35},{"$f":"Central!$M$26","v":0},{"$f":"Central!$M$14","v":8.35},{"$f":"Central!$G$26","v":6.4},{"$f":"Central!$I$26","v":6.4},{"$f":"Central!$M$26","v":0},{"$f":"Central!$I$58","v":"check name spelling"},{"$f":"Central!$G$36","v":7.3},{"$f":"Central!$I$36","v":7.3},{"$f":"Central!$M$36","v":0},{"$f":"Central!$K$58","v":"check name spelling"},{"$f":"Central!$G$46","v":8.3000000000000007},{"$f":"Central!$I$46","v":8.3000000000000007},{"$f":"Central!$M$46","v":0},{"$f":"Central!$M$58","v":"check name spelling"},{"$f":"Central!$O$58","v":0},{"$f":"Central!$C$1","v":"Central"},{"$f":"Central!$Q$58","v":0}]
[null,14,{"$f":"Central!$E$59","v":0},"V1",{"$f":"Central!$G$16","v":8.1999999999999993},{"$f":"Central!$I$16","v":8.1999999999999993},{"$f":"Central!$O$16","v":0},"V2",{"$f":"Central!$G$17","v":7.75},{"$f":"Central!$I$17","v":7.75},{"$f":"Central!$M$27","v":0},{"$f":"Central!$M$16","v":8.1999999999999993},{"$f":"Central!$G$27","v":7.5},{"$f":"Central!$I$27","v":7.5},{"$f":"Central!$M$27","v":0},{"$f":"Central!$I$59","v":"check name spelling"},{"$f":"Central!$G$37","v":7.05},{"$f":"Central!$I$37","v":7.05},{"$f":"Central!$M$37","v":0},{"$f":"Central!$K$59","v":"check name spelling"},{"$f":"Central!$G$47","v":8.9},{"$f":"Central!$I$47","v":8.9},{"$f":"Central!$M$47","v":0},{"$f":"Central!$M$59","v":"check name spelling"},{"$f":"Central!$O$59","v":0},{"$f":"Central!$C$1","v":"Central"},{"$f":"Central!$Q$59","v":0}]
[null,15,{"$f":"Johnson!$E$58","v":0},"V1",{"$f":"Johnson!$G$14","v":6.5},{"$f":"Johnson!$I$14","v":6.5},{"$f":"Johnson!$O$14","v":0},"V2",{"$f":"Johnson!$G$15","v":6.5},{"$f":"Johnson!$I$15","v":6.5},{"$f":"Johnson!$M$26","v":0},{"$f":"Johnson!$M$14","v":6.5},{"$f":"Johnson!$G$26","v":3.9},{"$f":"Johnson!$I$26","v":3.9},{"$f":"Johnson!$M$26","v":0},{"$f":"Johnson!$I$58","v":"check name spelling"},{"$f":"Johnson!$G$36","v":5.75},{"$f":"Johnson!$I$36","v":5.75},{"$f":"Johnson!$M$36","v":0},{"$f":"Johnson!$K$58","v":"check name spelling"},{"$f":"Johnson!$G$46","v":7.2},{"$f":"Johnson!$I$46","v":7.2},{"$f":"Johnson!$M$46","v":0},{"$f":"Johnson!$M$58","v":"check name spelling"},{"$f":"Johnson!$O$58","v":0},{"$f":"Johnson!$C$1","v":"Johnson"},{"$f":"Johnson!$Q$58","v":0}]
[null,16,{"$f":"Johnson!$E$59","v":0},"V1",{"$f":"Johnson!$G$16","v":6.6},{"$f":"Johnson!$I$16","v":6.6},{"$f":"Johnson!$O$16","v":0},"V2",{"$f":"Johnson!$G$17","v":6.8},{"$f":"Johnson!$I$17","v":6.8},{"$f":"Johnson!$M$27","v":0},{"$f":"Johnson!$M$16","v":6.8},{"$f":"Johnson!$G$27","v":6.9},{"$f":"Johnson!$I$27","v":6.9},{"$f":"Johnson!$M$27","v":0},{"$f":"Johnson!$I$59","v":"check name spelling"},{"$f":"Johnson!$G$37","v":4.7},{"$f":"Johnson!$I$37","v":4.7},{"$f":"Johnson!$M$37","v":0},{"$f":"Johnson!$K$59","v":"check name spelling"},{"$f":"Johnson!$G$47","v":7},{"$f":"Johnson!$I$47","v":7},{"$f":"Johnson!$M$47","v":0},{"$f":"Johnson!$M$59","v":"check name spelling"},{"$f":"Johnson!$O$59","v":0},{"$f":"Johnson!$C$1","v":"Johnson"},{"$f":"Johnson!$Q$59","v":0}]
[null,17,{"$f":"Como!$E$56","v":0},"V1",{"$f":"Como!$G$10","v":5.0999999999999996},{"$f":"Como!$I$10","v":5.0999999999999996},{"$f":"Como!$O$10","v":0},"V2",{"$f":"Como!$G$11","v":6.1},{"$f":"Como!$I$11","v":6.1},{"$f":"Como!$M$24","v":0},{"$f":"Como!$M$10","v":6.1},{"$f":"Como!$G$24","v":2.7},{"$f":"Como!$I$24","v":2.7},{"$f":"Como!$M$24","v":0},{"$f":"Como!$I$56","v":0},{"$f":"Como!$G$34","v":2.2999999999999998},{"$f":"Como!$I$34","v":2.2999999999999998},{"$f":"Como!$M$34","v":0},{"$f":"Como!$K$56","v":"check name spelling"},{"$f":"Como!$G$44","v":5.7},{"$f":"Como!$I$44","v":5.7},{"$f":"Como!$M$44","v":0},{"$f":"Como!$M$56","v":"check name spelling"},{"$f":"Como!$O$56","v":0},{"$f":"Como!$C$1","v":"Como"},{"$f":"Como!$Q$56","v":0}]
[null,18,{"$f":"Como!$E$57","v":0},"V1",{"$f":"Como!$G$12","v":6.35},{"$f":"Como!$I$12","v":6.35},{"$f":"Como!$O$12","v":0},"V2",{"$f":"Como!$G$13","v":6.2},{"$f":"Como!$I$13","v":6.2},{"$f":"Como!$M$25","v":0},{"$f":"Como!$M$12","v":6.35},{"$f":"Como!$G$25","v":3.3},{"$f":"Como!$I$25","v":3.3},{"$f":"Como!$M$25","v":0},{"$f":"Como!$I$57","v":0},{"$f":"Como!$G$35","v":3.6},{"$f":"Como!$I$35","v":3.6},{"$f":"Como!$M$35","v":0},{"$f":"Como!$K$57","v":"check name spelling"},{"$f":"Como!$G$45","v":4.7},{"$f":"Como!$I$45","v":4.7},{"$f":"Como!$M$45","v":0},{"$f":"Como!$M$57","v":"check name spelling"},{"$f":"Como!$O$57","v":0},{"$f":"Como!$C$1","v":"Como"},{"$f":"Como!$Q$57","v":0}]
[null,19,{"$f":"Como!$E$58","v":0},"V1",{"$f":"Como!$G$14","v":8.3000000000000007},{"$f":"Como!$I$14","v":8.3000000000000007},{"$f":"Como!$O$14","v":0},"V2",{"$f":"Como!$G$15","v":6.9},{"$f":"Como!$I$15","v":6.9},{"$f":"Como!$M$26","v":0},{"$f":"Como!$M$14","v":8.3000000000000007},{"$f":"Como!$G$26","v":6.5},{"$f":"Como!$I$26","v":6.5},{"$f":"Como!$M$26","v":0},{"$f":"Como!$I$58","v":0},{"$f":"Como!$G$36","v":4.9000000000000004},{"$f":"Como!$I$36","v":4.9000000000000004},{"$f":"Como!$M$36","v":0},{"$f":"Como!$K$58","v":"check name spelling"},{"$f":"Como!$G$46","v":5.9},{"$f":"Como!$I$46","v":5.9},{"$f":"Como!$M$46","v":0},{"$f":"Como!$M$58","v":"check name spelling"},{"$f":"Como!$O$58","v":0},{"$f":"Como!$C$1","v":"Como"},{"$f":"Como!$Q$58","v":0}]
[null,20,{"$f":"Como!$E$59","v":0},"V1",{"$f":"Como!$G$16","v":0},{"$f":"Como!$I$16","v":0},{"$f":"Como!$O$16","v":0},"V2",{"$f":"Como!$G$17","v":0},{"$f":"Como!$I$17","v":0},{"$f":"Como!$M$27","v":0},{"$f":"Como!$M$16","v":0},{"$f":"Como!$G$27","v":0},{"$f":"Como!$I$27","v":0},{"$f":"Como!$M$27","v":0},{"$f":"Como!$I$59","v":0},{"$f":"Como!$G$37","v":7.15},{"$f":"Como!$I$37","v":7.15},{"$f":"Como!$M$37","v":0},{"$f":"Como!$K$59","v":"check name spelling"},{"$f":"Como!$G$47","v":7.6},{"$f":"Como!$I$47","v":7.6},{"$f":"Como!$M$47","v":0},{"$f":"Como!$M$59","v":"check name spelling"},{"$f":"Como!$O$59","v":0},{"$f":"Como!$C$1","v":"Como"},{"$f":"Como!$Q$59","v":0}]

{"sheet":"Team","index":11,"n_rows":9,"n_cols":8,"rows_kept":9,"cut":false,"hidden":false,"merged":[[0,1,0,7],[1,1,1,7],[2,1,2,7]]}
[null,"Team Places"]
[null,{"$f":"'START HERE'!A22","v":"St. Paul Varsity Competition"}]
[null,{"$f":"'START HERE'!A23","v":"Feb. 6th, 2019"}]
[]
[null,"Place","Vault\nScore","Bars\nScore","Beam\nScore","Floor\nScore","Team \nTotal","Team"]
[null,1,{"$f":"Highland!$M$19","v":35.25},{"$f":"Highland!$K$29","v":32.349999999999994},{"$f":"Highland!$K$39","v":33.550000000000004},{"$f":"Highland!$K$49","v":35.4},{"$f":"Highland!$K$51","v":136.55000000000001},{"$f":"Highland!$C$1","v":"Highland"}]
[null,2,{"$f":"Central!$M$19","v":33.199999999999996},{"$f":"Central!$K$29","v":27.35},{"$f":"Central!$K$39","v":29.049999999999997},{"$f":"Central!$K$49","v":33.200000000000003},{"$f":"Central!$K$51","v":122.79999999999998},{"$f":"Central!$C$1","v":"Central"}]
[null,3,{"$f":"Johnson!$M$19","v":27.15},{"$f":"Johnson!$K$29","v":18.75},{"$f":"Johnson!$K$39","v":19.95},{"$f":"Johnson!$K$49","v":26.9},{"$f":"Johnson!$K$51","v":92.75},{"$f":"Johnson!$C$1","v":"Johnson"}]
[null,4,{"$f":"Como!$M$19","v":26.55},{"$f":"Como!$K$29","v":14.7},{"$f":"Como!$K$39","v":18.649999999999999},{"$f":"Como!$K$49","v":23.9},{"$f":"Como!$K$51","v":83.8},{"$f":"Como!$C$1","v":"Como"}]

{"sheet":"EULA","index":12,"n_rows":0,"n_cols":0,"rows_kept":0,"cut":false,"hidden":false,"merged":[]}